{"text_format":"1","workbook":"xlsx","n_sheets":20,"sheets":["STANDARD","STANDARD HYGIENE","COMPACT","E-FLOW","E-FLOW PARADA","E-FLOW RAMO","INTEGRA","INTEGRA MATERNELLE","INTEGRA PLINTHE","PARADA","PARADA PLINTHE","RAMO","RAMO PLINTHE","FARO H","FARO V","KOS H","KOS V","TINOS","PAROS","VERTICAL"],"not_rendered":{"charts":0,"images":0,"macros":0,"external_links":1,"defined_names":21,"comments":0,"pivot_tables":0},"unopened":[],"bounds":{"document_bytes":16777216,"sheet_cells":100000,"rows_first":2000,"rows_last":500,"rows_between":2000,"halvings":0,"cell_chars":16384,"cell_head_chars":4096},"cells_cut":0,"cells_raw":0,"read":"whole","date_system":"1900"}

{"sheet":"STANDARD","index":0,"n_rows":100,"n_cols":26,"rows_kept":100,"cut":false,"hidden":false,"merged":[[10,2,10,9],[10,10,10,17],[11,24,11,25],[33,2,33,3],[32,0,32,1],[10,18,10,25],[32,2,32,9],[32,10,32,17],[11,0,11,1],[11,2,11,3],[11,4,11,5],[11,6,11,7],[11,8,11,9],[11,10,11,11],[11,12,11,13],[11,14,11,15],[11,16,11,17],[10,0,10,1],[33,14,33,15],[33,0,33,1],[11,18,11,19],[11,20,11,21],[11,22,11,23],[33,4,33,5],[33,6,33,7],[33,8,33,9],[33,10,33,11],[33,12,33,13],[33,16,33,17],[32,18,32,25],[33,18,33,19],[33,20,33,21],[33,22,33,23],[33,24,33,25],[57,12,57,13],[57,14,57,15],[57,16,57,17],[57,0,57,1],[57,2,57,3],[57,4,57,5],[57,6,57,7],[57,8,57,9],[57,10,57,11],[59,12,59,13],[59,14,59,15],[80,2,80,9],[80,10,80,17],[58,0,58,1],[58,2,58,9],[58,10,58,17],[59,0,59,1],[59,2,59,3],[59,4,59,5],[59,6,59,7],[59,8,59,9],[81,14,81,15],[81,0,81,1],[59,18,59,19],[59,20,59,21],[59,22,59,23],[59,16,59,17],[81,2,81,3],[79,8,79,9],[79,10,79,11],[79,12,79,13],[79,14,79,15],[79,16,79,17],[79,2,79,3],[79,4,79,5],[79,6,79,7],[59,10,59,11],[81,4,81,5],[81,6,81,7],[81,8,81,9],[81,10,81,11],[81,12,81,13],[81,18,81,19],[81,20,81,21],[81,22,81,23],[81,24,81,25],[81,16,81,17],[2,2,2,6],[3,2,3,6],[4,2,4,6],[80,0,80,1],[58,18,58,25],[79,0,79,1],[57,18,57,19],[57,20,57,21],[57,22,57,23],[57,24,57,25],[80,18,80,25],[79,18,79,19],[79,20,79,21],[79,22,79,23],[79,24,79,25],[59,24,59,25]]}
["Programme de calcul de la puissance thermique: STANDARD"]
[]
["Te",75,"<= Entrez la température à l'entrée en C°"]
["Ts",65,"<= Entrez la température à la sortie en C°"]
["Ti",20,"<= Entrez la température ambiante en C°"]
["Rapport",{"$f":"(B4-B5)/(B3-B5)","v":0.81818181818181823}]
["Delta T",{"$f":"((B3+B4)/2)-B5","v":50}]
["Delta T2",{"$f":"(B3-B4)/LN((B3-B5)/(B4-B5))","v":49.83288654563971},"Si Rapport < 0,7"]
[]
[]
["Hauteur",null,{"$f":"C59","v":300},null,null,null,null,null,null,null,{"$f":"K59","v":400},null,null,null,null,null,null,null,{"$f":"S59","v":500}]
["Type",null,{"$f":"C60","v":"STD11"},null,{"$f":"E60","v":"STD21"},null,{"$f":"G60","v":"STD22"},null,{"$f":"I60","v":"STD33"},null,{"$f":"K60","v":"STD11"},null,{"$f":"M60","v":"STD21"},null,{"$f":"O60","v":"STD22"},null,{"$f":"Q60","v":"STD33"},null,{"$f":"S60","v":"STD11"},null,{"$f":"U60","v":"STD21"},null,{"$f":"W60","v":"STD22"},null,{"$f":"Y60","v":"STD33"}]
["Longueur (mm)","Nombre éléments","Modèle","Puissance (watts)     ","Modèle","Puissance (watts)     ","Modèle","Puissance (watts)     ","Modèle","Puissance (watts)     ","Modèle","Puissance (watts)     ","Modèle","Puissance (watts)     ","Modèle","Puissance (watts)     ","Modèle","Puissance (watts)     ","Modèle","Puissance (watts)     ","Modèle","Puissance (watts)     ","Modèle","Puissance (watts)     ","Modèle","Puissance (watts)     "]
[{"$f":"A62","v":450},{"$f":"B62","v":9},{"$f":"C62","v":"STD113000450"},{"$f":"IF(D62=\"\",\" - \",IF($B$6<0.7,D62*POWER($B$8/50,C$58),D62*POWER($B$7/50,C$58)))","v":247},{"$f":"E62","v":"STD213000450"},{"$f":"IF(F62=\"\",\" - \",IF($B$6<0.7,F62*POWER($B$8/50,E$58),F62*POWER($B$7/50,E$58)))","v":369},{"$f":"G62","v":"STD223000450"},{"$f":"IF(H62=\"\",\" - \",IF($B$6<0.7,H62*POWER($B$8/50,G$58),H62*POWER($B$7/50,G$58)))","v":482},{"$f":"I62","v":"STD333000450"},{"$f":"IF(J62=\"\",\" - \",IF($B$6<0.7,J62*POWER($B$8/50,I$58),J62*POWER($B$7/50,I$58)))","v":702},{"$f":"K62","v":"STD114000450"},{"$f":"IF(L62=\"\",\" - \",IF($B$6<0.7,L62*POWER($B$8/50,K$58),L62*POWER($B$7/50,K$58)))","v":317},{"$f":"M62","v":"STD214000450"},{"$f":"IF(N62=\"\",\" - \",IF($B$6<0.7,N62*POWER($B$8/50,M$58),N62*POWER($B$7/50,M$58)))","v":458},{"$f":"O62","v":"STD224000450"},{"$f":"IF(P62=\"\",\" - \",IF($B$6<0.7,P62*POWER($B$8/50,O$58),P62*POWER($B$7/50,O$58)))","v":614},{"$f":"Q62","v":"STD334000450"},{"$f":"IF(R62=\"\",\" - \",IF($B$6<0.7,R62*POWER($B$8/50,Q$58),R62*POWER($B$7/50,Q$58)))","v":901},{"$f":"S62","v":"STD115000450"},{"$f":"IF(T62=\"\",\" - \",IF($B$6<0.7,T62*POWER($B$8/50,S$58),T62*POWER($B$7/50,S$58)))","v":383},{"$f":"U62","v":"STD215000450"},{"$f":"IF(V62=\"\",\" - \",IF($B$6<0.7,V62*POWER($B$8/50,U$58),V62*POWER($B$7/50,U$58)))","v":540},{"$f":"W62","v":"STD225000450"},{"$f":"IF(X62=\"\",\" - \",IF($B$6<0.7,X62*POWER($B$8/50,W$58),X62*POWER($B$7/50,W$58)))","v":734},{"$f":"Y62","v":"STD335000450"},{"$f":"IF(Z62=\"\",\" - \",IF($B$6<0.7,Z62*POWER($B$8/50,Y$58),Z62*POWER($B$7/50,Y$58)))","v":1081}]
[{"$f":"A63","v":600},12,"STD113000600",329,{"$f":"E63","v":"STD213000600"},493,{"$f":"G63","v":"STD223000600"},643,{"$f":"I63","v":"STD333000600"},935,{"$f":"K63","v":"STD114000600"},423,{"$f":"M63","v":"STD214000600"},611,{"$f":"O63","v":"STD224000600"},818,{"$f":"Q63","v":"STD334000600"},1201,"STD115000600",511,"STD215000600",720,"STD225000600",979,"STD335000600",1442]
[750,15,"STD113000750",412,"STD213000750",616,"STD223000750",804,"STD333000750",1169,"STD114000750",529,"STD214000750",764,"STD224000750",1023,"STD334000750",1502,"STD115000750",639,"STD215000750",900,"STD225000750",1224,"STD335000750",1802]
[900,18,"STD113000900",494,"STD213000900",739,"STD223000900",965,"STD333000900",1403,"STD114000900",635,"STD214000900",916,"STD224000900",1228,"STD334000900",1802,"STD115000900",767,"STD215000900",1080,"STD225000900",1469,"STD335000900",2163]
[1050,21,"STD113001050",576,"STD213001050",862,"STD223001050",1126,"STD333001050",1637,"STD114001050",740,"STD214001050",1069,"STD224001050",1432,"STD334001050",2102,"STD115001050",895,"STD215001050",1260,"STD225001050",1714,"STD335001050",2523]
[1200,24,"STD113001200",659,"STD213001200",985,"STD223001200",1286,"STD333001200",1871,"STD114001200",846,"STD214001200",1222,"STD224001200",1637,"STD334001200",2402,"STD115001200",1022,"STD215001200",1440,"STD225001200",1958,"STD335001200",2884]
[1350,27,"STD113001350",741,"STD213001350",1108,"STD223001350",1447,"STD333001350",2105,"STD114001350",952,"STD214001350",1374,"STD224001350",1841,"STD334001350",2703,"STD115001350",1150,"STD215001350",1620,"STD225001350",2203,"STD335001350",3244]
[1500,30,"STD113001500",824,"STD213001500",1232,"STD223001500",1608,"STD333001500",2339,"STD114001500",1058,"STD214001500",1527,"STD224001500",2046,"STD334001500",3003,"STD115001500",1278,"STD215001500",1800,"STD225001500",2448,"STD335001500",3605]
[1650,33,"STD113001650",906,"STD213001650",1355,"STD223001650",1769,"STD333001650",2572,"STD114001650",1163,"STD214001650",1680,"STD224001650",2251,"STD334001650",3303,"STD115001650",1406,"STD215001650",1980,"STD225001650",2693,"STD335001650",3965]
[1800,36,"STD113001800",988,"STD213001800",1478,"STD223001800",1930,"STD333001800",2806,"STD114001800",1269,"STD214001800",1832,"STD224001800",2455,"STD334001800",3604,"STD115001800",1534,"STD215001800",2160,"STD225001800",2938,"STD335001800",4325]
[1950,39," - "," - ","STD213001950",1601,"STD223001950",2090,"STD333001950",3040," - "," - ","STD214001950",1985,"STD224001950",2660,"STD334001950",3904," - "," - ","STD215001950",2340,"STD225001950",3182,"STD335001950",4686]
[2100,42," - "," - ","STD213002100",1724,"STD223002100",2251,"STD333002100",3274," - "," - ","STD214002100",2138,"STD224002100",2864,"STD334002100",4204," - "," - ","STD215002100",2520,"STD225002100",3427,"STD335002100",5046]
[2250,45," - "," - ","STD213002250",1847,"STD223002250",2412,"STD333002250",3508," - "," - ","STD214002250",2291,"STD224002250",3069,"STD334002250",4505," - "," - ","STD215002250",2700,"STD225002250",3672,"STD335002250",5407]
[2400,48," - "," - ","STD213002400",1970,"STD223002400",2573,"STD333002400",3742," - "," - ","STD214002400",2443,"STD224002400",3274,"STD334002400",4805," - "," - ","STD215002400",2880,"STD225002400",3917,"STD335002400",5767]
[2550,51," - "," - ","STD213002550",2094,"STD223002550",2734,"STD333002550",3975," - "," - ","STD214002550",2596,"STD224002550",3478,"STD334002550",5105," - "," - ","STD215002550",3060,"STD225002550",4162,"STD335002550",6128]
[2700,54," - "," - ","STD213002700",2217,"STD223002700",2894,"STD333002700",4209," - "," - ","STD214002700",2749,"STD224002700",3683,"STD334002700",5405," - "," - ","STD215002700",3240,"STD225002700",4406,"STD335002700",6488]
[3000,60," - "," - ","STD213003000",2463,"STD223003000",3216,"STD333003000",4677," - "," - ","STD214003000",3054,"STD224003000",4092,"STD334003000",6006," - "," - ","STD215003000",3600,"STD225003000",4896,"STD335003000",7209]
[]
[]
["Hauteur",null,{"$f":"C81","v":600},null,null,null,null,null,null,null,{"$f":"K81","v":750},null,null,null,null,null,null,null,{"$f":"S81","v":900}]
["Type",null,{"$f":"C82","v":"STD11"},null,{"$f":"E82","v":"STD21"},null,{"$f":"G82","v":"STD22"},null,{"$f":"I82","v":"STD33"},null,{"$f":"K82","v":"STD11"},null,{"$f":"M82","v":"STD21"},null,{"$f":"O82","v":"STD22"},null,{"$f":"Q82","v":"STD33"},null,{"$f":"S82","v":"STD11"},null,{"$f":"U82","v":"STD21"},null,{"$f":"W82","v":"STD22"},null,{"$f":"Y82","v":"STD33"}]
["Longueur (mm)","Nombre éléments","Modèle","Puissance (watts)     ","Modèle","Puissance (watts)     ","Modèle","Puissance (watts)     ","Modèle","Puissance (watts)     ","Modèle","Puissance (watts)     ","Modèle","Puissance (watts)     ","Modèle","Puissance (watts)     ","Modèle","Puissance (watts)     ","Modèle","Puissance (watts)     ","Modèle","Puissance (watts)     ","Modèle","Puissance (watts)     ","Modèle","Puissance (watts)     "]
[{"$f":"A84","v":450},{"$f":"B84","v":9},{"$f":"C84","v":"STD116000450"},{"$f":"IF(D84=\"\",\" - \",IF($B$6<0.7,D84*POWER($B$8/50,C$80),D84*POWER($B$7/50,C$80)))","v":446},{"$f":"E84","v":"STD216000450"},{"$f":"IF(F84=\"\",\" - \",IF($B$6<0.7,F84*POWER($B$8/50,E$80),F84*POWER($B$7/50,E$80)))","v":617},{"$f":"G84","v":"STD226000450"},{"$f":"IF(H84=\"\",\" - \",IF($B$6<0.7,H84*POWER($B$8/50,G$80),H84*POWER($B$7/50,G$80)))","v":846},{"$f":"I84","v":"STD336000450"},{"$f":"IF(J84=\"\",\" - \",IF($B$6<0.7,J84*POWER($B$8/50,I$80),J84*POWER($B$7/50,I$80)))","v":1244},{"$f":"K84","v":"STD117500450"},{"$f":"IF(L84=\"\",\" - \",IF($B$6<0.7,L84*POWER($B$8/50,K$80),L84*POWER($B$7/50,K$80)))","v":534},{"$f":"M84","v":"STD217500450"},{"$f":"IF(N84=\"\",\" - \",IF($B$6<0.7,N84*POWER($B$8/50,M$80),N84*POWER($B$7/50,M$80)))","v":726},{"$f":"O84","v":"STD227500450"},{"$f":"IF(P84=\"\",\" - \",IF($B$6<0.7,P84*POWER($B$8/50,O$80),P84*POWER($B$7/50,O$80)))","v":996},{"$f":"Q84","v":"STD337500450"},{"$f":"IF(R84=\"\",\" - \",IF($B$6<0.7,R84*POWER($B$8/50,Q$80),R84*POWER($B$7/50,Q$80)))","v":1458},{"$f":"S84","v":"STD119000450"},{"$f":"IF(T84=\"\",\" - \",IF($B$6<0.7,T84*POWER($B$8/50,S$80),T84*POWER($B$7/50,S$80)))","v":614},{"$f":"U84","v":"STD219000450"},{"$f":"IF(V84=\"\",\" - \",IF($B$6<0.7,V84*POWER($B$8/50,U$80),V84*POWER($B$7/50,U$80)))","v":826},{"$f":"W84","v":"STD229000450"},{"$f":"IF(X84=\"\",\" - \",IF($B$6<0.7,X84*POWER($B$8/50,W$80),X84*POWER($B$7/50,W$80)))","v":1128},{"$f":"Y84","v":"STD339000450"},{"$f":"IF(Z84=\"\",\" - \",IF($B$6<0.7,Z84*POWER($B$8/50,Y$80),Z84*POWER($B$7/50,Y$80)))","v":1637}]
[{"$f":"A85","v":600},12,{"$f":"C85","v":"STD116000600"},595,"STD216000600",823,"STD226000600",1127,"STD336000600",1659,"STD117500600",712,"STD217500600",968,"STD227500600",1328,"STD337500600",1944,"STD119000600",819,"STD219000600",1102,"STD229000600",1504,"STD339000600",2183]
[750,15,"STD116000750",744,"STD216000750",1029,"STD226000750",1409,"STD336000750",2074,"STD117500750",890,"STD217500750",1210,"STD227500750",1660,"STD337500750",2430,"STD119000750",1024,"STD219000750",1377,"STD229000750",1880,"STD339000750",2729]
[900,18,"STD116000900",893,"STD216000900",1235,"STD226000900",1691,"STD336000900",2489,"STD117500900",1067,"STD217500900",1452,"STD227500900",1992,"STD337500900",2916,"STD119000900",1229,"STD219000900",1652,"STD229000900",2256,"STD339000900",3274]
[1050,21,"STD116001050",1042,"STD216001050",1441,"STD226001050",1973,"STD336001050",2903,"STD117501050",1245,"STD217501050",1694,"STD227501050",2324,"STD337501050",3402,"STD119001050",1433,"STD219001050",1928,"STD229001050",2632,"STD339001050",3820]
[1200,24,"STD116001200",1190,"STD216001200",1646,"STD226001200",2255,"STD336001200",3318,"STD117501200",1423,"STD217501200",1936,"STD227501200",2656,"STD337501200",3888,"STD119001200",1638,"STD219001200",2203,"STD229001200",3008,"STD339001200",4366]
[1350,27,"STD116001350",1339,"STD216001350",1852,"STD226001350",2537,"STD336001350",3733,"STD117501350",1601,"STD217501350",2178,"STD227501350",2988,"STD337501350",4374,"STD119001350",1843,"STD219001350",2479,"STD229001350",3384,"STD339001350",4911]
[1500,30,"STD116001500",1488,"STD216001500",2058,"STD226001500",2819,"STD336001500",4148,"STD117501500",1779,"STD217501500",2420,"STD227501500",3320,"STD337501500",4860,"STD119001500",2048,"STD219001500",2754,"STD229001500",3761,"STD339001500",5457]
[1650,33,"STD116001650",1637,"STD216001650",2264,"STD226001650",3100,"STD336001650",4562,"STD117501650",1957,"STD217501650",2661,"STD227501650",3651,"STD337501650",5346,"STD119001650",2252,"STD219001650",3029,"STD229001650",4137,"STD339001650",6003]
[1800,36,"STD116001800",1786,"STD216001800",2470,"STD226001800",3382,"STD336001800",4977,"STD117501800",2135,"STD217501800",2903,"STD227501800",3983,"STD337501800",5832,"STD119001800",2457,"STD219001800",3305,"STD229001800",4513,"STD339001800",6548]
[1950,39," - "," - ","STD216001950",2675,"STD226001950",3664,"STD336001950",5392," - "," - ","STD217501950",3145,"STD227501950",4315,"STD337501950",6318," - "," - ","STD219001950",3580,"STD229001950",4889,"STD339001950",7094]
[2100,42," - "," - ","STD216002100",2881,"STD226002100",3946,"STD336002100",5807," - "," - ","STD217502100",3387,"STD227502100",4647,"STD337502100",6804," - "," - ","STD219002100",3856,"STD229002100",5265,"STD339002100",7640]
[2250,45," - "," - ","STD216002250",3087,"STD226002250",4228,"STD336002250",6221," - "," - ","STD217502250",3629,"STD227502250",4979,"STD337502250",7290," - "," - ","STD219002250",4131,"STD229002250",5641,"STD339002250",8186]
[2400,48," - "," - ","STD216002400",3293,"STD226002400",4510,"STD336002400",6636," - "," - ","STD217502400",3871,"STD227502400",5311,"STD337502400",7776," - "," - ","STD219002400",4406,"STD229002400",6017,"STD339002400",8731]
[2550,51," - "," - ","STD216002550",3499,"STD226002550",4791,"STD336002550",7051," - "," - ","STD217502550",4113,"STD227502550",5643,"STD337502550",8262," - "," - ","STD219002550",4682,"STD229002550",6393,"STD339002550",9277]
[2700,54," - "," - ","STD216002700",3704,"STD226002700",5073,"STD336002700",7466," - "," - ","STD217502700",4355,"STD227502700",5975,"STD337502700",8748," - "," - ","STD219002700",4957,"STD229002700",6769,"STD339002700",9823]
[3000,60," - "," - ","STD216003000",4116,"STD226003000",5637,"STD336003000",8295," - "," - ","STD217503000",4839,"STD227503000",6639,"STD337503000",9720," - "," - ","STD219003000",5508,"STD229003000",7521,"STD339003000",10914]
[]
[]
[]
["Tableau de référence"]
[]
["PENTE :",null,1.3513999999999999,null,1.3608,null,1.3908,null,1.4025000000000001,null,1.3460000000000001,null,1.3589,null,1.3826000000000001,null,1.39,null,1.3406,null,1.357,null,1.3745000000000001,null,1.3774999999999999]
["Hauteur",null,300,null,null,null,null,null,null,null,400,null,null,null,null,null,null,null,500]
["Type",null,"STD11",null,"STD21",null,"STD22",null,"STD33",null,"STD11",null,"STD21",null,"STD22",null,"STD33",null,"STD11",null,"STD21",null,"STD22",null,"STD33"]
["Longueur (mm)","Nombre éléments","Modèle","Watt \nDt 50°C","Modèle","Watt \nDt 50°C","Modèle","Watt \nDt 50°C","Modèle","Watt \nDt 50°C","Modèle","Watt \nDt 50°C","Modèle","Watt \nDt 50°C","Modèle","Watt \nDt 50°C","Modèle","Watt \nDt 50°C","Modèle","Watt \nDt 50°C","Modèle","Watt \nDt 50°C","Modèle","Watt \nDt 50°C","Modèle","Watt \nDt 50°C"]
[450,{"$f":"A62/50","v":9},{"$f":"IF(D62=\"\",\" - \",IF(LEN($A62)=3,C$60&$C$59&\"0\"&$A62,C$60&$C$59&$A62))","v":"STD113000450"},247,{"$f":"IF(F62=\"\",\" - \",IF(LEN($A62)=3,E$60&$C$59&\"0\"&$A62,E$60&$C$59&$A62))","v":"STD213000450"},369,{"$f":"IF(H62=\"\",\" - \",IF(LEN($A62)=3,G$60&$C$59&\"0\"&$A62,G$60&$C$59&$A62))","v":"STD223000450"},482,{"$f":"IF(J62=\"\",\" - \",IF(LEN($A62)=3,I$60&$C$59&\"0\"&$A62,I$60&$C$59&$A62))","v":"STD333000450"},702,{"$f":"IF(L62=\"\",\" - \",IF(LEN($A62)=3,K$60&$K$59&\"0\"&$A62,K$60&$K$59&$A62))","v":"STD114000450"},317,{"$f":"IF(N62=\"\",\" - \",IF(LEN($A62)=3,M$60&$K$59&\"0\"&$A62,M$60&$K$59&$A62))","v":"STD214000450"},458,{"$f":"IF(P62=\"\",\" - \",IF(LEN($A62)=3,O$60&$K$59&\"0\"&$A62,O$60&$K$59&$A62))","v":"STD224000450"},614,{"$f":"IF(R62=\"\",\" - \",IF(LEN($A62)=3,Q$60&$K$59&\"0\"&$A62,Q$60&$K$59&$A62))","v":"STD334000450"},901,{"$f":"IF(T62=\"\",\" - \",IF(LEN($A62)=3,S$60&$S$59&\"0\"&$A62,S$60&$S$59&$A62))","v":"STD115000450"},383,{"$f":"IF(V62=\"\",\" - \",IF(LEN($A62)=3,U$60&$S$59&\"0\"&$A62,U$60&$S$59&$A62))","v":"STD215000450"},540,{"$f":"IF(X62=\"\",\" - \",IF(LEN($A62)=3,W$60&$S$59&\"0\"&$A62,W$60&$S$59&$A62))","v":"STD225000450"},734,{"$f":"IF(Z62=\"\",\" - \",IF(LEN($A62)=3,Y$60&$S$59&\"0\"&$A62,Y$60&$S$59&$A62))","v":"STD335000450"},1081]
[600,{"$f":"A63/50","v":12},"STD113000600",329,"STD213000600",493,"STD223000600",643,"STD333000600",935,"STD114000600",423,"STD214000600",611,"STD224000600",818,"STD334000600",1201,"STD115000600",511,"STD215000600",720,"STD225000600",979,"STD335000600",1442]
[750,15,"STD113000750",412,"STD213000750",616,"STD223000750",804,"STD333000750",1169,"STD114000750",529,"STD214000750",764,"STD224000750",1023,"STD334000750",1502,"STD115000750",639,"STD215000750",900,"STD225000750",1224,"STD335000750",1802]
[900,18,"STD113000900",494,"STD213000900",739,"STD223000900",965,"STD333000900",1403,"STD114000900",635,"STD214000900",916,"STD224000900",1228,"STD334000900",1802,"STD115000900",767,"STD215000900",1080,"STD225000900",1469,"STD335000900",2163]
[1050,21,"STD113001050",576,"STD213001050",862,"STD223001050",1126,"STD333001050",1637,"STD114001050",740,"STD214001050",1069,"STD224001050",1432,"STD334001050",2102,"STD115001050",895,"STD215001050",1260,"STD225001050",1714,"STD335001050",2523]
[1200,24,"STD113001200",659,"STD213001200",985,"STD223001200",1286,"STD333001200",1871,"STD114001200",846,"STD214001200",1222,"STD224001200",1637,"STD334001200",2402,"STD115001200",1022,"STD215001200",1440,"STD225001200",1958,"STD335001200",2884]
[1350,27,"STD113001350",741,"STD213001350",1108,"STD223001350",1447,"STD333001350",2105,"STD114001350",952,"STD214001350",1374,"STD224001350",1841,"STD334001350",2703,"STD115001350",1150,"STD215001350",1620,"STD225001350",2203,"STD335001350",3244]
[1500,30,"STD113001500",824,"STD213001500",1232,"STD223001500",1608,"STD333001500",2339,"STD114001500",1058,"STD214001500",1527,"STD224001500",2046,"STD334001500",3003,"STD115001500",1278,"STD215001500",1800,"STD225001500",2448,"STD335001500",3605]
[1650,33,"STD113001650",906,"STD213001650",1355,"STD223001650",1769,"STD333001650",2572,"STD114001650",1163,"STD214001650",1680,"STD224001650",2251,"STD334001650",3303,"STD115001650",1406,"STD215001650",1980,"STD225001650",2693,"STD335001650",3965]
[1800,36,"STD113001800",988,"STD213001800",1478,"STD223001800",1930,"STD333001800",2806,"STD114001800",1269,"STD214001800",1832,"STD224001800",2455,"STD334001800",3604,"STD115001800",1534,"STD215001800",2160,"STD225001800",2938,"STD335001800",4325]
[1950,39," - ",null,"STD213001950",1601,"STD223001950",2090,"STD333001950",3040," - ",null,"STD214001950",1985,"STD224001950",2660,"STD334001950",3904," - ",null,"STD215001950",2340,"STD225001950",3182,"STD335001950",4686]
[2100,42," - ",null,"STD213002100",1724,"STD223002100",2251,"STD333002100",3274," - ",null,"STD214002100",2138,"STD224002100",2864,"STD334002100",4204," - ",null,"STD215002100",2520,"STD225002100",3427,"STD335002100",5046]
[2250,45," - ",null,"STD213002250",1847,"STD223002250",2412,"STD333002250",3508," - ",null,"STD214002250",2291,"STD224002250",3069,"STD334002250",4505," - ",null,"STD215002250",2700,"STD225002250",3672,"STD335002250",5407]
[2400,48," - ",null,"STD213002400",1970,"STD223002400",2573,"STD333002400",3742," - ",null,"STD214002400",2443,"STD224002400",3274,"STD334002400",4805," - ",null,"STD215002400",2880,"STD225002400",3917,"STD335002400",5767]
[2550,51," - ",null,"STD213002550",2094,"STD223002550",2734,"STD333002550",3975," - ",null,"STD214002550",2596,"STD224002550",3478,"STD334002550",5105," - ",null,"STD215002550",3060,"STD225002550",4162,"STD335002550",6128]
[2700,54," - ",null,"STD213002700",2217,"STD223002700",2894,"STD333002700",4209," - ",null,"STD214002700",2749,"STD224002700",3683,"STD334002700",5405," - ",null,"STD215002700",3240,"STD225002700",4406,"STD335002700",6488]
[3000,60," - ",null,"STD213003000",2463,"STD223003000",3216,"STD333003000",4677," - ",null,"STD214003000",3054,"STD224003000",4092,"STD334003000",6006," - ",null,"STD215003000",3600,"STD225003000",4896,"STD335003000",7209]
[]
["PENTE :",null,1.3352999999999999,null,1.3535999999999999,null,1.3663000000000001,null,1.365,null,1.3271999999999999,null,1.3522000000000001,null,1.3540000000000001,null,1.3462000000000001,null,1.3190999999999999,null,1.3492999999999999,null,1.3418000000000001,null,1.3273999999999999]
["Hauteur",null,600,null,null,null,null,null,null,null,750,null,null,null,null,null,null,null,900]
["Type",null,"STD11",null,"STD21",null,"STD22",null,"STD33",null,"STD11",null,"STD21",null,"STD22",null,"STD33",null,"STD11",null,"STD21",null,"STD22",null,"STD33"]
["Longueur (mm)","Nombre éléments","Modèle","Watt \nDt 50°C","Modèle","Watt \nDt 50°C","Modèle","Watt \nDt 50°C","Modèle","Watt \nDt 50°C","Modèle","Watt \nDt 50°C","Modèle","Watt \nDt 50°C","Modèle","Watt \nDt 50°C","Modèle","Watt \nDt 50°C","Modèle","Watt \nDt 50°C","Modèle","Watt \nDt 50°C","Modèle","Watt \nDt 50°C","Modèle","Watt \nDt 50°C"]
[450,{"$f":"A84/50","v":9},{"$f":"IF(D84=\"\",\" - \",IF(LEN($A84)=3,C$82&$C$81&\"0\"&$A84,C$82&$C$81&$A84))","v":"STD116000450"},446,{"$f":"IF(F84=\"\",\" - \",IF(LEN($A84)=3,E$82&$C$81&\"0\"&$A84,E$82&$C$81&$A84))","v":"STD216000450"},617,{"$f":"IF(H84=\"\",\" - \",IF(LEN($A84)=3,G$82&$C$81&\"0\"&$A84,G$82&$C$81&$A84))","v":"STD226000450"},846,{"$f":"IF(J84=\"\",\" - \",IF(LEN($A84)=3,I$82&$C$81&\"0\"&$A84,I$82&$C$81&$A84))","v":"STD336000450"},1244,{"$f":"IF(L84=\"\",\" - \",IF(LEN($A84)=3,K$82&$K$81&\"0\"&$A84,K$82&$K$81&$A84))","v":"STD117500450"},534,{"$f":"IF(N84=\"\",\" - \",IF(LEN($A84)=3,M$82&$K$81&\"0\"&$A84,M$82&$K$81&$A84))","v":"STD217500450"},726,{"$f":"IF(P84=\"\",\" - \",IF(LEN($A84)=3,O$82&$K$81&\"0\"&$A84,O$82&$K$81&$A84))","v":"STD227500450"},996,{"$f":"IF(R84=\"\",\" - \",IF(LEN($A84)=3,Q$82&$K$81&\"0\"&$A84,Q$82&$K$81&$A84))","v":"STD337500450"},1458,{"$f":"IF(T84=\"\",\" - \",IF(LEN($A84)=3,S$82&$S$81&\"0\"&$A84,S$82&$S$81&$A84))","v":"STD119000450"},614,{"$f":"IF(V84=\"\",\" - \",IF(LEN($A84)=3,U$82&$S$81&\"0\"&$A84,U$82&$S$81&$A84))","v":"STD219000450"},826,{"$f":"IF(X84=\"\",\" - \",IF(LEN($A84)=3,W$82&$S$81&\"0\"&$A84,W$82&$S$81&$A84))","v":"STD229000450"},1128,{"$f":"IF(Z84=\"\",\" - \",IF(LEN($A84)=3,Y$82&$S$81&\"0\"&$A84,Y$82&$S$81&$A84))","v":"STD339000450"},1637]
[600,{"$f":"A85/50","v":12},"STD116000600",595,"STD216000600",823,"STD226000600",1127,"STD336000600",1659,"STD117500600",712,"STD217500600",968,"STD227500600",1328,"STD337500600",1944,"STD119000600",819,"STD219000600",1102,"STD229000600",1504,"STD339000600",2183]
[750,15,"STD116000750",744,"STD216000750",1029,"STD226000750",1409,"STD336000750",2074,"STD117500750",890,"STD217500750",1210,"STD227500750",1660,"STD337500750",2430,"STD119000750",1024,"STD219000750",1377,"STD229000750",1880,"STD339000750",2729]
[900,18,"STD116000900",893,"STD216000900",1235,"STD226000900",1691,"STD336000900",2489,"STD117500900",1067,"STD217500900",1452,"STD227500900",1992,"STD337500900",2916,"STD119000900",1229,"STD219000900",1652,"STD229000900",2256,"STD339000900",3274]
[1050,21,"STD116001050",1042,"STD216001050",1441,"STD226001050",1973,"STD336001050",2903,"STD117501050",1245,"STD217501050",1694,"STD227501050",2324,"STD337501050",3402,"STD119001050",1433,"STD219001050",1928,"STD229001050",2632,"STD339001050",3820]
[1200,24,"STD116001200",1190,"STD216001200",1646,"STD226001200",2255,"STD336001200",3318,"STD117501200",1423,"STD217501200",1936,"STD227501200",2656,"STD337501200",3888,"STD119001200",1638,"STD219001200",2203,"STD229001200",3008,"STD339001200",4366]
[1350,27,"STD116001350",1339,"STD216001350",1852,"STD226001350",2537,"STD336001350",3733,"STD117501350",1601,"STD217501350",2178,"STD227501350",2988,"STD337501350",4374,"STD119001350",1843,"STD219001350",2479,"STD229001350",3384,"STD339001350",4911]
[1500,30,"STD116001500",1488,"STD216001500",2058,"STD226001500",2819,"STD336001500",4148,"STD117501500",1779,"STD217501500",2420,"STD227501500",3320,"STD337501500",4860,"STD119001500",2048,"STD219001500",2754,"STD229001500",3761,"STD339001500",5457]
[1650,33,"STD116001650",1637,"STD216001650",2264,"STD226001650",3100,"STD336001650",4562,"STD117501650",1957,"STD217501650",2661,"STD227501650",3651,"STD337501650",5346,"STD119001650",2252,"STD219001650",3029,"STD229001650",4137,"STD339001650",6003]
[1800,36,"STD116001800",1786,"STD216001800",2470,"STD226001800",3382,"STD336001800",4977,"STD117501800",2135,"STD217501800",2903,"STD227501800",3983,"STD337501800",5832,"STD119001800",2457,"STD219001800",3305,"STD229001800",4513,"STD339001800",6548]
[1950,39," - ",null,"STD216001950",2675,"STD226001950",3664,"STD336001950",5392," - ",null,"STD217501950",3145,"STD227501950",4315,"STD337501950",6318," - ",null,"STD219001950",3580,"STD229001950",4889,"STD339001950",7094]
[2100,42," - ",null,"STD216002100",2881,"STD226002100",3946,"STD336002100",5807," - ",null,"STD217502100",3387,"STD227502100",4647,"STD337502100",6804," - ",null,"STD219002100",3856,"STD229002100",5265,"STD339002100",7640]
[2250,45," - ",null,"STD216002250",3087,"STD226002250",4228,"STD336002250",6221," - ",null,"STD217502250",3629,"STD227502250",4979,"STD337502250",7290," - ",null,"STD219002250",4131,"STD229002250",5641,"STD339002250",8186]
[2400,48," - ",null,"STD216002400",3293,"STD226002400",4510,"STD336002400",6636," - ",null,"STD217502400",3871,"STD227502400",5311,"STD337502400",7776," - ",null,"STD219002400",4406,"STD229002400",6017,"STD339002400",8731]
[2550,51," - ",null,"STD216002550",3499,"STD226002550",4791,"STD336002550",7051," - ",null,"STD217502550",4113,"STD227502550",5643,"STD337502550",8262," - ",null,"STD219002550",4682,"STD229002550",6393,"STD339002550",9277]
[2700,54," - ",null,"STD216002700",3704,"STD226002700",5073,"STD336002700",7466," - ",null,"STD217502700",4355,"STD227502700",5975,"STD337502700",8748," - ",null,"STD219002700",4957,"STD229002700",6769,"STD339002700",9823]
[3000,60," - ",null,"STD216003000",4116,"STD226003000",5637,"STD336003000",8295," - ",null,"STD217503000",4839,"STD227503000",6639,"STD337503000",9720," - ",null,"STD219003000",5508,"STD229003000",7521,"STD339003000",10914]

{"sheet":"STANDARD HYGIENE","index":1,"n_rows":100,"n_cols":20,"rows_kept":100,"cut":false,"hidden":false,"merged":[[2,2,2,6],[3,2,3,6],[4,2,4,6],[10,8,10,13],[32,0,32,1],[10,14,10,19],[32,2,32,7],[32,8,32,13],[11,0,11,1],[11,2,11,3],[11,4,11,5],[11,6,11,7],[11,8,11,9],[11,10,11,11],[11,12,11,13],[10,0,10,1],[10,2,10,7],[33,0,33,1],[11,14,11,15],[11,16,11,17],[11,18,11,19],[33,2,33,3],[33,4,33,5],[33,6,33,7],[33,8,33,9],[33,10,33,11],[33,12,33,13],[32,14,32,19],[33,14,33,15],[33,16,33,17],[33,18,33,19],[57,14,57,15],[57,16,57,17],[57,18,57,19],[79,2,79,3],[57,0,57,1],[57,2,57,3],[57,4,57,5],[57,6,57,7],[57,8,57,9],[57,10,57,11],[57,12,57,13],[58,0,58,1],[58,2,58,7],[58,8,58,13],[59,0,59,1],[59,2,59,3],[81,4,81,5],[81,0,81,1],[59,14,59,15],[59,16,59,17],[59,18,59,19],[81,2,81,3],[81,6,81,7],[81,8,81,9],[81,10,81,11],[81,12,81,13],[79,4,79,5],[79,6,79,7],[79,8,79,9],[79,10,79,11],[79,12,79,13],[79,0,79,1],[80,0,80,1],[58,14,58,19],[80,2,80,7],[80,8,80,13],[80,14,80,19],[59,4,59,5],[59,6,59,7],[59,8,59,9],[59,10,59,11],[59,12,59,13],[81,14,81,15],[81,16,81,17],[81,18,81,19],[79,14,79,15],[79,16,79,17],[79,18,79,19]]}
["Programme de calcul de la puissance thermique: STANDARD"]
[]
["Te",75,"<= Entrez la température à l'entrée en C°"]
["Ts",65,"<= Entrez la température à la sortie en C°"]
["Ti",20,"<= Entrez la température ambiante en C°"]
["Rapport",{"$f":"(B4-B5)/(B3-B5)","v":0.81818181818181823}]
["Delta T",{"$f":"((B3+B4)/2)-B5","v":50}]
["Delta T2",{"$f":"(B3-B4)/LN((B3-B5)/(B4-B5))","v":49.83288654563971},"Si Rapport < 0,7"]
[]
[]
["Hauteur",null,{"$f":"C59","v":300},null,null,null,null,null,{"$f":"I59","v":400},null,null,null,null,null,{"$f":"O59","v":500}]
["Type",null,{"$f":"C60","v":"STD10"},null,{"$f":"E60","v":"STD20"},null,{"$f":"G60","v":"HYG30"},null,{"$f":"I60","v":"STD10"},null,{"$f":"K60","v":"STD20"},null,{"$f":"M60","v":"HYG30"},null,{"$f":"O60","v":"STD10"},null,{"$f":"Q60","v":"STD20"},null,{"$f":"S60","v":"HYG30"}]
["Longueur (mm)","Nombre éléments","Modèle","Puissance (watts)     ","Modèle","Puissance (watts)     ","Modèle","Puissance (watts)     ","Modèle","Puissance (watts)     ","Modèle","Puissance (watts)     ","Modèle","Puissance (watts)     ","Modèle","Puissance (watts)     ","Modèle","Puissance (watts)     ","Modèle","Puissance (watts)     "]
[{"$f":"A62","v":450},{"$f":"B62","v":9},{"$f":"C62","v":"STD103000450"},{"$f":"IF(D62=\"\",\" - \",IF($B$6<0.7,D62*POWER($B$8/50,C$58),D62*POWER($B$7/50,C$58)))","v":145},{"$f":"E62","v":"STD203000450"},{"$f":"IF(F62=\"\",\" - \",IF($B$6<0.7,F62*POWER($B$8/50,E$58),F62*POWER($B$7/50,E$58)))","v":255},{"$f":"G62","v":"HYG303000450"},{"$f":"IF(H62=\"\",\" - \",IF($B$6<0.7,H62*POWER($B$8/50,G$58),H62*POWER($B$7/50,G$58)))","v":382},{"$f":"I62","v":"STD104000450"},{"$f":"IF(J62=\"\",\" - \",IF($B$6<0.7,J62*POWER($B$8/50,I$58),J62*POWER($B$7/50,I$58)))","v":186},{"$f":"K62","v":"STD204000450"},{"$f":"IF(L62=\"\",\" - \",IF($B$6<0.7,L62*POWER($B$8/50,K$58),L62*POWER($B$7/50,K$58)))","v":324},{"$f":"M62","v":"HYG304000450"},{"$f":"IF(N62=\"\",\" - \",IF($B$6<0.7,N62*POWER($B$8/50,M$58),N62*POWER($B$7/50,M$58)))","v":476},{"$f":"O62","v":"STD105000450"},{"$f":"IF(P62=\"\",\" - \",IF($B$6<0.7,P62*POWER($B$8/50,O$58),P62*POWER($B$7/50,O$58)))","v":225},{"$f":"Q62","v":"STD205000450"},{"$f":"IF(R62=\"\",\" - \",IF($B$6<0.7,R62*POWER($B$8/50,Q$58),R62*POWER($B$7/50,Q$58)))","v":390},{"$f":"S62","v":"HYG305000450"},{"$f":"IF(T62=\"\",\" - \",IF($B$6<0.7,T62*POWER($B$8/50,S$58),T62*POWER($B$7/50,S$58)))","v":567}]
[{"$f":"A63","v":600},12,"STD103000600",193,{"$f":"E63","v":"STD203000600"},340,{"$f":"G63","v":"HYG303000600"},509,{"$f":"I63","v":"STD104000600"},248,{"$f":"K63","v":"STD204000600"},432,{"$f":"M63","v":"HYG304000600"},634,"STD105000600",301,"STD205000600",520,"HYG305000600",755]
[750,15,"STD103000750",242,"STD203000750",425,"HYG303000750",636,"STD104000750",310,"STD204000750",540,"HYG304000750",793,"STD105000750",376,"STD205000750",650,"HYG305000750",944]
[900,18,"STD103000900",290,"STD203000900",510,"HYG303000900",763,"STD104000900",372,"STD204000900",648,"HYG304000900",951,"STD105000900",451,"STD205000900",779,"HYG305000900",1133]
[1050,21,"STD103001050",338,"STD203001050",595,"HYG303001050",890,"STD104001050",434,"STD204001050",756,"HYG304001050",1110,"STD105001050",526,"STD205001050",909,"HYG305001050",1322]
[1200,24,"STD103001200",386,"STD203001200",680,"HYG303001200",1018,"STD104001200",496,"STD204001200",864,"HYG304001200",1268,"STD105001200",601,"STD205001200",1039,"HYG305001200",1511]
[1350,27,"STD103001350",435,"STD203001350",765,"HYG303001350",1145,"STD104001350",558,"STD204001350",972,"HYG304001350",1427,"STD105001350",676,"STD205001350",1169,"HYG305001350",1700]
[1500,30,"STD103001500",483,"STD203001500",851,"HYG303001500",1272,"STD104001500",620,"STD204001500",1080,"HYG304001500",1586,"STD105001500",752,"STD205001500",1299,"HYG305001500",1889]
[1650,33,"STD103001650",531,"STD203001650",936,"HYG303001650",1399,"STD104001650",681,"STD204001650",1188,"HYG304001650",1744,"STD105001650",827,"STD205001650",1429,"HYG305001650",2077]
[1800,36,"STD103001800",580,"STD203001800",1021,"HYG303001800",1526,"STD104001800",743,"STD204001800",1296,"HYG304001800",1903,"STD105001800",902,"STD205001800",1559,"HYG305001800",2266]
[1950,39," - "," - ","STD203001950",1106,"HYG303001950",1654," - "," - ","STD204001950",1404,"HYG304001950",2061," - "," - ","STD205001950",1689,"HYG305001950",2455]
[2100,42," - "," - ","STD203002100",1191,"HYG303002100",1781," - "," - ","STD204002100",1512,"HYG304002100",2220," - "," - ","STD205002100",1819,"HYG305002100",2644]
[2250,45," - "," - ","STD203002250",1276,"HYG303002250",1908," - "," - ","STD204002250",1620,"HYG304002250",2378," - "," - ","STD205002250",1949,"HYG305002250",2833]
[2400,48," - "," - ","STD203002400",1361,"HYG303002400",2035," - "," - ","STD204002400",1728,"HYG304002400",2537," - "," - ","STD205002400",2078,"HYG305002400",3022]
[2550,51," - "," - ","STD203002550",1446,"HYG303002550",2162," - "," - ","STD204002550",1836,"HYG304002550",2695," - "," - ","STD205002550",2208,"HYG305002550",3210]
[2700,54," - "," - ","STD203002700",1531,"HYG303002700",2290," - "," - ","STD204002700",1944,"HYG304002700",2854," - "," - ","STD205002700",2338,"HYG305002700",3399]
[3000,60," - "," - ","STD203003000",1701,"HYG303003000",2544," - "," - ","STD204003000",2160,"HYG304003000",3171," - "," - ","STD205003000",2598,"HYG305003000",3777]
[]
[]
["Hauteur",null,{"$f":"C81","v":600},null,null,null,null,null,{"$f":"I81","v":750},null,null,null,null,null,{"$f":"O81","v":900}]
["Type",null,{"$f":"C82","v":"STD10"},null,{"$f":"E82","v":"STD20"},null,{"$f":"G82","v":"HYG30"},null,{"$f":"I82","v":"STD10"},null,{"$f":"K82","v":"STD20"},null,{"$f":"M82","v":"HYG30"},null,{"$f":"O82","v":"STD10"},null,{"$f":"Q82","v":"STD20"},null,{"$f":"S82","v":"HYG30"}]
["Longueur (mm)","Nombre éléments","Modèle","Puissance (watts)     ","Modèle","Puissance (watts)     ","Modèle","Puissance (watts)     ","Modèle","Puissance (watts)     ","Modèle","Puissance (watts)     ","Modèle","Puissance (watts)     ","Modèle","Puissance (watts)     ","Modèle","Puissance (watts)     ","Modèle","Puissance (watts)     "]
[{"$f":"A84","v":450},{"$f":"B84","v":9},{"$f":"C84","v":"STD106000450"},{"$f":"IF(D84=\"\",\" - \",IF($B$6<0.7,D84*POWER($B$8/50,C$80),D84*POWER($B$7/50,C$80)))","v":263},{"$f":"E84","v":"STD206000450"},{"$f":"IF(F84=\"\",\" - \",IF($B$6<0.7,F84*POWER($B$8/50,E$80),F84*POWER($B$7/50,E$80)))","v":454},{"$f":"G84","v":"HYG306000450"},{"$f":"IF(H84=\"\",\" - \",IF($B$6<0.7,H84*POWER($B$8/50,G$80),H84*POWER($B$7/50,G$80)))","v":656},{"$f":"I84","v":"STD107500450"},{"$f":"IF(J84=\"\",\" - \",IF($B$6<0.7,J84*POWER($B$8/50,I$80),J84*POWER($B$7/50,I$80)))","v":318},{"$f":"K84","v":"STD207500450"},{"$f":"IF(L84=\"\",\" - \",IF($B$6<0.7,L84*POWER($B$8/50,K$80),L84*POWER($B$7/50,K$80)))","v":548},{"$f":"M84","v":"HYG307500450"},{"$f":"IF(N84=\"\",\" - \",IF($B$6<0.7,N84*POWER($B$8/50,M$80),N84*POWER($B$7/50,M$80)))","v":788},{"$f":"O84","v":"STD109000450"},{"$f":"IF(P84=\"\",\" - \",IF($B$6<0.7,P84*POWER($B$8/50,O$80),P84*POWER($B$7/50,O$80)))","v":370},{"$f":"Q84","v":"STD209000450"},{"$f":"IF(R84=\"\",\" - \",IF($B$6<0.7,R84*POWER($B$8/50,Q$80),R84*POWER($B$7/50,Q$80)))","v":640},{"$f":"S84","v":"HYG309000450"},{"$f":"IF(T84=\"\",\" - \",IF($B$6<0.7,T84*POWER($B$8/50,S$80),T84*POWER($B$7/50,S$80)))","v":919}]
[{"$f":"A85","v":600},12,{"$f":"C85","v":"STD106000600"},351,"STD206000600",605,"HYG306000600",874,"STD107500600",424,"STD207500600",730,"HYG307500600",1051,"STD109000600",493,"STD209000600",853,"HYG309000600",1226]
[750,15,"STD106000750",439,"STD206000750",757,"HYG306000750",1093,"STD107500750",530,"STD207500750",913,"HYG307500750",1313,"STD109000750",617,"STD209000750",1067,"HYG309000750",1532]
[900,18,"STD106000900",527,"STD206000900",908,"HYG306000900",1311,"STD107500900",635,"STD207500900",1095,"HYG307500900",1576,"STD109000900",740,"STD209000900",1280,"HYG309000900",1839]
[1050,21,"STD106001050",614,"STD206001050",1059,"HYG306001050",1530,"STD107501050",741,"STD207501050",1278,"HYG307501050",1839,"STD109001050",863,"STD209001050",1493,"HYG309001050",2145]
[1200,24,"STD106001200",702,"STD206001200",1211,"HYG306001200",1748,"STD107501200",847,"STD207501200",1460,"HYG307501200",2101,"STD109001200",986,"STD209001200",1706,"HYG309001200",2452]
[1350,27,"STD106001350",790,"STD206001350",1362,"HYG306001350",1967,"STD107501350",953,"STD207501350",1643,"HYG307501350",2364,"STD109001350",1110,"STD209001350",1920,"HYG309001350",2758]
[1500,30,"STD106001500",878,"STD206001500",1514,"HYG306001500",2186,"STD107501500",1059,"STD207501500",1826,"HYG307501500",2627,"STD109001500",1233,"STD209001500",2133,"HYG309001500",3065]
[1650,33,"STD106001650",965,"STD206001650",1665,"HYG306001650",2404,"STD107501650",1165,"STD207501650",2008,"HYG307501650",2889,"STD109001650",1356,"STD209001650",2346,"HYG309001650",3371]
[1800,36,"STD106001800",1053,"STD206001800",1816,"HYG306001800",2623,"STD107501800",1271,"STD207501800",2191,"HYG307501800",3152,"STD109001800",1480,"STD209001800",2560,"HYG309001800",3677]
[1950,39," - "," - ","STD206001950",1968,"HYG306001950",2841," - "," - ","STD207501950",2373,"HYG307501950",3414," - "," - ","STD209001950",2773,"HYG309001950",3984]
[2100,42," - "," - ","STD206002100",2119,"HYG306002100",3060," - "," - ","STD207502100",2556,"HYG307502100",3677," - "," - ","STD209002100",2986,"HYG309002100",4290]
[2250,45," - "," - ","STD206002250",2270,"HYG306002250",3278," - "," - ","STD207502250",2738,"HYG307502250",3940," - "," - ","STD209002250",3200,"HYG309002250",4597]
[2400,48," - "," - ","STD206002400",2422,"HYG306002400",3497," - "," - ","STD207502400",2921,"HYG307502400",4202," - "," - ","STD209002400",3413,"HYG309002400",4903]
[2550,51," - "," - ","STD206002550",2573,"HYG306002550",3715," - "," - ","STD207502550",3103,"HYG307502550",4465," - "," - ","STD209002550",3626,"HYG309002550",5210]
[2700,54," - "," - ","STD206002700",2724,"HYG306002700",3934," - "," - ","STD207502700",3286,"HYG307502700",4728," - "," - ","STD209002700",3839,"HYG309002700",5516]
[3000,60," - "," - ","STD206003000",3027,"HYG306003000",4371," - "," - ","STD207503000",3651,"HYG307503000",5253," - "," - ","STD209003000",4266,"HYG309003000",6129]
[]
[]
[]
["Tableau de référence"]
[]
["PENTE :",null,1.3325,null,1.3709,null,1.2830999999999999,null,1.3307,null,1.3466,null,1.2875000000000001,null,1.3288,null,1.3222,null,1.2919]
["Hauteur",null,300,null,null,null,null,null,400,null,null,null,null,null,500]
["Type",null,"STD10",null,"STD20",null,"HYG30",null,"STD10",null,"STD20",null,"HYG30",null,"STD10",null,"STD20",null,"HYG30"]
["Longueur (mm)","Nombre éléments","Modèle","Watt \nDt 50°C","Modèle","Watt \nDt 50°C","Modèle","Watt \nDt 50°C","Modèle","Watt \nDt 50°C","Modèle","Watt \nDt 50°C","Modèle","Watt \nDt 50°C","Modèle","Watt \nDt 50°C","Modèle","Watt \nDt 50°C","Modèle","Watt \nDt 50°C"]
[450,{"$f":"A62/50","v":9},{"$f":"IF(D62=\"\",\" - \",IF(LEN($A62)=3,C$60&$C$59&\"0\"&$A62,C$60&$C$59&$A62))","v":"STD103000450"},145,{"$f":"IF(F62=\"\",\" - \",IF(LEN($A62)=3,E$60&$C$59&\"0\"&$A62,E$60&$C$59&$A62))","v":"STD203000450"},255,{"$f":"IF(H62=\"\",\" - \",IF(LEN($A62)=3,G$60&$C$59&\"0\"&$A62,G$60&$C$59&$A62))","v":"HYG303000450"},382,{"$f":"IF(J62=\"\",\" - \",IF(LEN($A62)=3,I$60&$I$59&\"0\"&$A62,I$60&$I$59&$A62))","v":"STD104000450"},186,{"$f":"IF(L62=\"\",\" - \",IF(LEN($A62)=3,K$60&$I$59&\"0\"&$A62,K$60&$I$59&$A62))","v":"STD204000450"},324,{"$f":"IF(N62=\"\",\" - \",IF(LEN($A62)=3,M$60&$I$59&\"0\"&$A62,M$60&$I$59&$A62))","v":"HYG304000450"},476,{"$f":"IF(P62=\"\",\" - \",IF(LEN($A62)=3,O$60&$O$59&\"0\"&$A62,O$60&$O$59&$A62))","v":"STD105000450"},225,{"$f":"IF(R62=\"\",\" - \",IF(LEN($A62)=3,Q$60&$O$59&\"0\"&$A62,Q$60&$O$59&$A62))","v":"STD205000450"},390,{"$f":"IF(T62=\"\",\" - \",IF(LEN($A62)=3,S$60&$O$59&\"0\"&$A62,S$60&$O$59&$A62))","v":"HYG305000450"},567]
[600,{"$f":"A63/50","v":12},"STD103000600",193,"STD203000600",340,"HYG303000600",509,"STD104000600",248,"STD204000600",432,"HYG304000600",634,"STD105000600",301,"STD205000600",520,"HYG305000600",755]
[750,15,"STD103000750",242,"STD203000750",425,"HYG303000750",636,"STD104000750",310,"STD204000750",540,"HYG304000750",793,"STD105000750",376,"STD205000750",650,"HYG305000750",944]
[900,18,"STD103000900",290,"STD203000900",510,"HYG303000900",763,"STD104000900",372,"STD204000900",648,"HYG304000900",951,"STD105000900",451,"STD205000900",779,"HYG305000900",1133]
[1050,21,"STD103001050",338,"STD203001050",595,"HYG303001050",890,"STD104001050",434,"STD204001050",756,"HYG304001050",1110,"STD105001050",526,"STD205001050",909,"HYG305001050",1322]
[1200,24,"STD103001200",386,"STD203001200",680,"HYG303001200",1018,"STD104001200",496,"STD204001200",864,"HYG304001200",1268,"STD105001200",601,"STD205001200",1039,"HYG305001200",1511]
[1350,27,"STD103001350",435,"STD203001350",765,"HYG303001350",1145,"STD104001350",558,"STD204001350",972,"HYG304001350",1427,"STD105001350",676,"STD205001350",1169,"HYG305001350",1700]
[1500,30,"STD103001500",483,"STD203001500",851,"HYG303001500",1272,"STD104001500",620,"STD204001500",1080,"HYG304001500",1586,"STD105001500",752,"STD205001500",1299,"HYG305001500",1889]
[1650,33,"STD103001650",531,"STD203001650",936,"HYG303001650",1399,"STD104001650",681,"STD204001650",1188,"HYG304001650",1744,"STD105001650",827,"STD205001650",1429,"HYG305001650",2077]
[1800,36,"STD103001800",580,"STD203001800",1021,"HYG303001800",1526,"STD104001800",743,"STD204001800",1296,"HYG304001800",1903,"STD105001800",902,"STD205001800",1559,"HYG305001800",2266]
[1950,39," - ",null,"STD203001950",1106,"HYG303001950",1654," - ",null,"STD204001950",1404,"HYG304001950",2061," - ",null,"STD205001950",1689,"HYG305001950",2455]
[2100,42," - ",null,"STD203002100",1191,"HYG303002100",1781," - ",null,"STD204002100",1512,"HYG304002100",2220," - ",null,"STD205002100",1819,"HYG305002100",2644]
[2250,45," - ",null,"STD203002250",1276,"HYG303002250",1908," - ",null,"STD204002250",1620,"HYG304002250",2378," - ",null,"STD205002250",1949,"HYG305002250",2833]
[2400,48," - ",null,"STD203002400",1361,"HYG303002400",2035," - ",null,"STD204002400",1728,"HYG304002400",2537," - ",null,"STD205002400",2078,"HYG305002400",3022]
[2550,51," - ",null,"STD203002550",1446,"HYG303002550",2162," - ",null,"STD204002550",1836,"HYG304002550",2695," - ",null,"STD205002550",2208,"HYG305002550",3210]
[2700,54," - ",null,"STD203002700",1531,"HYG303002700",2290," - ",null,"STD204002700",1944,"HYG304002700",2854," - ",null,"STD205002700",2338,"HYG305002700",3399]
[3000,60," - ",null,"STD203003000",1701,"HYG303003000",2544," - ",null,"STD204003000",2160,"HYG304003000",3171," - ",null,"STD205003000",2598,"HYG305003000",3777]
[]
["PENTE :",null,1.327,null,1.2979000000000001,null,1.2963,null,1.3242,null,1.2613000000000001,null,1.3028999999999999,null,1.3214999999999999,null,1.2248000000000001,null,1.3093999999999999]
["Hauteur",null,600,null,null,null,null,null,750,null,null,null,null,null,900]
["Type",null,"STD10",null,"STD20",null,"HYG30",null,"STD10",null,"STD20",null,"HYG30",null,"STD10",null,"STD20",null,"HYG30"]
["Longueur (mm)","Nombre éléments","Modèle","Watt \nDt 50°C","Modèle","Watt \nDt 50°C","Modèle","Watt \nDt 50°C","Modèle","Watt \nDt 50°C","Modèle","Watt \nDt 50°C","Modèle","Watt \nDt 50°C","Modèle","Watt \nDt 50°C","Modèle","Watt \nDt 50°C","Modèle","Watt \nDt 50°C"]
[450,{"$f":"A84/50","v":9},{"$f":"IF(D84=\"\",\" - \",IF(LEN($A84)=3,C$82&$C$81&\"0\"&$A84,C$82&$C$81&$A84))","v":"STD106000450"},263,{"$f":"IF(F84=\"\",\" - \",IF(LEN($A84)=3,E$82&$C$81&\"0\"&$A84,E$82&$C$81&$A84))","v":"STD206000450"},454,{"$f":"IF(H84=\"\",\" - \",IF(LEN($A84)=3,G$82&$C$81&\"0\"&$A84,G$82&$C$81&$A84))","v":"HYG306000450"},656,{"$f":"IF(J84=\"\",\" - \",IF(LEN($A84)=3,I$82&$I$81&\"0\"&$A84,I$82&$I$81&$A84))","v":"STD107500450"},318,{"$f":"IF(L84=\"\",\" - \",IF(LEN($A84)=3,K$82&$I$81&\"0\"&$A84,K$82&$I$81&$A84))","v":"STD207500450"},548,{"$f":"IF(N84=\"\",\" - \",IF(LEN($A84)=3,M$82&$I$81&\"0\"&$A84,M$82&$I$81&$A84))","v":"HYG307500450"},788,{"$f":"IF(P84=\"\",\" - \",IF(LEN($A84)=3,O$82&$O$81&\"0\"&$A84,O$82&$O$81&$A84))","v":"STD109000450"},370,{"$f":"IF(R84=\"\",\" - \",IF(LEN($A84)=3,Q$82&$O$81&\"0\"&$A84,Q$82&$O$81&$A84))","v":"STD209000450"},640,{"$f":"IF(T84=\"\",\" - \",IF(LEN($A84)=3,S$82&$O$81&\"0\"&$A84,S$82&$O$81&$A84))","v":"HYG309000450"},919]
[600,{"$f":"A85/50","v":12},"STD106000600",351,"STD206000600",605,"HYG306000600",874,"STD107500600",424,"STD207500600",730,"HYG307500600",1051,"STD109000600",493,"STD209000600",853,"HYG309000600",1226]
[750,15,"STD106000750",439,"STD206000750",757,"HYG306000750",1093,"STD107500750",530,"STD207500750",913,"HYG307500750",1313,"STD109000750",617,"STD209000750",1067,"HYG309000750",1532]
[900,18,"STD106000900",527,"STD206000900",908,"HYG306000900",1311,"STD107500900",635,"STD207500900",1095,"HYG307500900",1576,"STD109000900",740,"STD209000900",1280,"HYG309000900",1839]
[1050,21,"STD106001050",614,"STD206001050",1059,"HYG306001050",1530,"STD107501050",741,"STD207501050",1278,"HYG307501050",1839,"STD109001050",863,"STD209001050",1493,"HYG309001050",2145]
[1200,24,"STD106001200",702,"STD206001200",1211,"HYG306001200",1748,"STD107501200",847,"STD207501200",1460,"HYG307501200",2101,"STD109001200",986,"STD209001200",1706,"HYG309001200",2452]
[1350,27,"STD106001350",790,"STD206001350",1362,"HYG306001350",1967,"STD107501350",953,"STD207501350",1643,"HYG307501350",2364,"STD109001350",1110,"STD209001350",1920,"HYG309001350",2758]
[1500,30,"STD106001500",878,"STD206001500",1514,"HYG306001500",2186,"STD107501500",1059,"STD207501500",1826,"HYG307501500",2627,"STD109001500",1233,"STD209001500",2133,"HYG309001500",3065]
[1650,33,"STD106001650",965,"STD206001650",1665,"HYG306001650",2404,"STD107501650",1165,"STD207501650",2008,"HYG307501650",2889,"STD109001650",1356,"STD209001650",2346,"HYG309001650",3371]
[1800,36,"STD106001800",1053,"STD206001800",1816,"HYG306001800",2623,"STD107501800",1271,"STD207501800",2191,"HYG307501800",3152,"STD109001800",1480,"STD209001800",2560,"HYG309001800",3677]
[1950,39," - ",null,"STD206001950",1968,"HYG306001950",2841," - ",null,"STD207501950",2373,"HYG307501950",3414," - ",null,"STD209001950",2773,"HYG309001950",3984]
[2100,42," - ",null,"STD206002100",2119,"HYG306002100",3060," - ",null,"STD207502100",2556,"HYG307502100",3677," - ",null,"STD209002100",2986,"HYG309002100",4290]
[2250,45," - ",null,"STD206002250",2270,"HYG306002250",3278," - ",null,"STD207502250",2738,"HYG307502250",3940," - ",null,"STD209002250",3200,"HYG309002250",4597]
[2400,48," - ",null,"STD206002400",2422,"HYG306002400",3497," - ",null,"STD207502400",2921,"HYG307502400",4202," - ",null,"STD209002400",3413,"HYG309002400",4903]
[2550,51," - ",null,"STD206002550",2573,"HYG306002550",3715," - ",null,"STD207502550",3103,"HYG307502550",4465," - ",null,"STD209002550",3626,"HYG309002550",5210]
[2700,54," - ",null,"STD206002700",2724,"HYG306002700",3934," - ",null,"STD207502700",3286,"HYG307502700",4728," - ",null,"STD209002700",3839,"HYG309002700",5516]
[3000,60," - ",null,"STD206003000",3027,"HYG306003000",4371," - ",null,"STD207503000",3651,"HYG307503000",5253," - ",null,"STD209003000",4266,"HYG309003000",6129]

{"sheet":"COMPACT","index":2,"n_rows":100,"n_cols":31,"rows_kept":100,"cut":false,"hidden":false,"merged":[[80,18,80,25],[79,18,79,19],[81,24,81,25],[81,22,81,23],[81,20,81,21],[81,18,81,19],[79,20,79,21],[79,22,79,23],[79,24,79,25],[33,0,33,1],[33,2,33,3],[33,4,33,5],[33,6,33,7],[33,8,33,9],[57,0,57,1],[79,4,79,5],[79,6,79,7],[57,22,57,23],[58,0,58,1],[58,2,58,9],[59,0,59,1],[59,2,59,3],[59,4,59,5],[59,6,59,7],[59,8,59,9],[79,2,79,3],[57,18,57,19],[57,20,57,21],[57,12,57,13],[57,14,57,15],[10,0,10,1],[10,2,10,9],[32,0,32,1],[10,18,10,25],[11,0,11,1],[11,2,11,3],[11,4,11,5],[11,6,11,7],[11,8,11,9],[32,10,32,17],[10,10,10,17],[11,18,11,19],[11,20,11,21],[11,22,11,23],[11,24,11,25],[32,2,32,9],[2,2,2,6],[3,2,3,6],[4,2,4,6],[33,22,33,23],[33,20,33,21],[33,18,33,19],[32,18,32,25],[33,24,33,25],[33,10,33,11],[33,12,33,13],[33,14,33,15],[33,16,33,17],[11,10,11,11],[11,12,11,13],[11,14,11,15],[57,24,57,25],[79,8,79,9],[79,10,79,11],[79,0,79,1],[11,16,11,17],[57,16,57,17],[58,10,58,17],[59,12,59,13],[59,14,59,15],[59,16,59,17],[59,10,59,11],[57,10,57,11],[57,2,57,3],[57,4,57,5],[57,6,57,7],[57,8,57,9],[59,22,59,23],[58,18,58,25],[59,18,59,19],[59,24,59,25],[59,20,59,21],[81,14,81,15],[79,12,79,13],[79,14,79,15],[79,16,79,17],[80,0,80,1],[80,2,80,9],[80,10,80,17],[81,16,81,17],[81,10,81,11],[81,0,81,1],[81,2,81,3],[81,4,81,5],[81,6,81,7],[81,8,81,9],[81,12,81,13]]}
["Programme de calcul de la puissance thermique: COMPACT"]
[]
["Te",75,"<= Entrez la température à l'entrée en C°"]
["Ts",65,"<= Entrez la température à la sortie en C°"]
["Ti",20,"<= Entrez la température ambiante en C°"]
["Rapport",{"$f":"(B4-B5)/(B3-B5)","v":0.81818181818181823}]
["Delta T",{"$f":"((B3+B4)/2)-B5","v":50}]
["Delta T2",{"$f":"(B3-B4)/LN((B3-B5)/(B4-B5))","v":49.83288654563971},"Si Rapport < 0,7"]
[]
[]
["Hauteur",null,{"$f":"C59","v":300},null,null,null,null,null,null,null,{"$f":"K59","v":400},null,null,null,null,null,null,null,{"$f":"S59","v":500}]
["Type",null,{"$f":"C60","v":"KMP11"},null,{"$f":"E60","v":"KMP21"},null,{"$f":"G60","v":"KMP22"},null,{"$f":"I60","v":"KMP33"},null,{"$f":"K60","v":"KMP11"},null,{"$f":"M60","v":"KMP21"},null,{"$f":"O60","v":"KMP22"},null,{"$f":"Q60","v":"KMP33"},null,{"$f":"S60","v":"KMP11"},null,{"$f":"U60","v":"KMP21"},null,{"$f":"W60","v":"KMP22"},null,{"$f":"Y60","v":"KMP33"}]
["Longueur (mm)","Nombre éléments","Modèle","Puissance (watts)     ","Modèle","Puissance (watts)     ","Modèle","Puissance (watts)     ","Modèle","Puissance (watts)     ","Modèle","Puissance (watts)     ","Modèle","Puissance (watts)     ","Modèle","Puissance (watts)     ","Modèle","Puissance (watts)     ","Modèle","Puissance (watts)     ","Modèle","Puissance (watts)     ","Modèle","Puissance (watts)     ","Modèle","Puissance (watts)     "]
[{"$f":"A62","v":450},{"$f":"B62","v":9},{"$f":"C62","v":"KMP113000450"},{"$f":"IF(D62=\"\",\" - \",IF($B$6<0.7,D62*POWER($B$8/50,C$58),D62*POWER($B$7/50,C$58)))","v":248},{"$f":"E62","v":"KMP213000450"},{"$f":"IF(F62=\"\",\" - \",IF($B$6<0.7,F62*POWER($B$8/50,E$58),F62*POWER($B$7/50,E$58)))","v":361},{"$f":"G62","v":"KMP223000450"},{"$f":"IF(H62=\"\",\" - \",IF($B$6<0.7,H62*POWER($B$8/50,G$58),H62*POWER($B$7/50,G$58)))","v":474},{"$f":"I62","v":"KMP333000450"},{"$f":"IF(J62=\"\",\" - \",IF($B$6<0.7,J62*POWER($B$8/50,I$58),J62*POWER($B$7/50,I$58)))","v":672},{"$f":"K62","v":"KMP114000450"},{"$f":"IF(L62=\"\",\" - \",IF($B$6<0.7,L62*POWER($B$8/50,K$58),L62*POWER($B$7/50,K$58)))","v":318},{"$f":"M62","v":"KMP214000450"},{"$f":"IF(N62=\"\",\" - \",IF($B$6<0.7,N62*POWER($B$8/50,M$58),N62*POWER($B$7/50,M$58)))","v":448},{"$f":"O62","v":"KMP224000450"},{"$f":"IF(P62=\"\",\" - \",IF($B$6<0.7,P62*POWER($B$8/50,O$58),P62*POWER($B$7/50,O$58)))","v":601},{"$f":"Q62","v":"KMP334000450"},{"$f":"IF(R62=\"\",\" - \",IF($B$6<0.7,R62*POWER($B$8/50,Q$58),R62*POWER($B$7/50,Q$58)))","v":863},{"$f":"S62","v":"KMP115000450"},{"$f":"IF(T62=\"\",\" - \",IF($B$6<0.7,T62*POWER($B$8/50,S$58),T62*POWER($B$7/50,S$58)))","v":384},{"$f":"U62","v":"KMP215000450"},{"$f":"IF(V62=\"\",\" - \",IF($B$6<0.7,V62*POWER($B$8/50,U$58),V62*POWER($B$7/50,U$58)))","v":530},{"$f":"W62","v":"KMP225000450"},{"$f":"IF(X62=\"\",\" - \",IF($B$6<0.7,X62*POWER($B$8/50,W$58),X62*POWER($B$7/50,W$58)))","v":718},{"$f":"Y62","v":"KMP335000450"},{"$f":"IF(Z62=\"\",\" - \",IF($B$6<0.7,Z62*POWER($B$8/50,Y$58),Z62*POWER($B$7/50,Y$58)))","v":1037}]
[{"$f":"A63","v":600},12,{"$f":"C63","v":"KMP113000600"},331,{"$f":"E63","v":"KMP213000600"},481,{"$f":"G63","v":"KMP223000600"},632,{"$f":"I63","v":"KMP333000600"},896,{"$f":"K63","v":"KMP114000600"},424,{"$f":"M63","v":"KMP214000600"},598,{"$f":"O63","v":"KMP224000600"},802,{"$f":"Q63","v":"KMP334000600"},1151,"KMP115000600",512,"KMP215000600",706,"KMP225000600",957,"KMP335000600",1383]
[{"$f":"A64","v":750},15,"KMP113000750",413,"KMP213000750",602,"KMP223000750",790,"KMP333000750",1121,"KMP114000750",530,"KMP214000750",747,"KMP224000750",1002,"KMP334000750",1439,"KMP115000750",640,"KMP215000750",883,"KMP225000750",1196,"KMP335000750",1729]
[{"$f":"A65","v":900},18,"KMP113000900",496,"KMP213000900",722,"KMP223000900",948,"KMP333000900",1345,"KMP114000900",635,"KMP214000900",896,"KMP224000900",1202,"KMP334000900",1726,"KMP115000900",768,"KMP215000900",1059,"KMP225000900",1436,"KMP335000900",2075]
[{"$f":"A66","v":1050},21,"KMP113001050",579,"KMP213001050",842,"KMP223001050",1106,"KMP333001050",1569,"KMP114001050",741,"KMP214001050",1046,"KMP224001050",1403,"KMP334001050",2014,"KMP115001050",896,"KMP215001050",1236,"KMP225001050",1675,"KMP335001050",2420]
[{"$f":"A67","v":1200},24,"KMP113001200",661,"KMP213001200",962,"KMP223001200",1264,"KMP333001200",1793,"KMP114001200",847,"KMP214001200",1195,"KMP224001200",1603,"KMP334001200",2302,"KMP115001200",1024,"KMP215001200",1412,"KMP225001200",1914,"KMP335001200",2766]
[{"$f":"A68","v":1350},27,"KMP113001350",744,"KMP213001350",1083,"KMP223001350",1422,"KMP333001350",2017,"KMP114001350",953,"KMP214001350",1345,"KMP224001350",1804,"KMP334001350",2589,"KMP115001350",1152,"KMP215001350",1589,"KMP225001350",2153,"KMP335001350",3112]
[{"$f":"A69","v":1500},30,"KMP113001500",827,"KMP213001500",1203,"KMP223001500",1580,"KMP333001500",2241,"KMP114001500",1059,"KMP214001500",1494,"KMP224001500",2004,"KMP334001500",2877,"KMP115001500",1280,"KMP215001500",1766,"KMP225001500",2393,"KMP335001500",3458]
[{"$f":"A70","v":1650},33,"KMP113001650",909,"KMP213001650",1323,"KMP223001650",1737,"KMP333001650",2465,"KMP114001650",1165,"KMP214001650",1643,"KMP224001650",2204,"KMP334001650",3165,"KMP115001650",1407,"KMP215001650",1942,"KMP225001650",2632,"KMP335001650",3803]
[{"$f":"A71","v":1800},36,"KMP113001800",992,"KMP213001800",1444,"KMP223001800",1895,"KMP333001800",2689,"KMP114001800",1271,"KMP214001800",1793,"KMP224001800",2405,"KMP334001800",3452,"KMP115001800",1535,"KMP215001800",2119,"KMP225001800",2871,"KMP335001800",4149]
[{"$f":"A72","v":1950},39,"KMP113001950",1074,"KMP213001950",1564,"KMP223001950",2053,"KMP333001950",2913,"KMP114001950",1377,"KMP214001950",1942,"KMP224001950",2605,"KMP334001950",3740,"KMP115001950",1663,"KMP215001950",2295,"KMP225001950",3110,"KMP335001950",4495]
[{"$f":"A73","v":2100},42,"KMP113002100",1157,"KMP213002100",1684,"KMP223002100",2211,"KMP333002100",3137,"KMP114002100",1483,"KMP214002100",2092,"KMP224002100",2806,"KMP334002100",4028,"KMP115002100",1791,"KMP215002100",2472,"KMP225002100",3350,"KMP335002100",4841]
[{"$f":"A74","v":2250},45,"KMP113002250",1240,"KMP213002250",1805,"KMP223002250",2369,"KMP333002250",3362,"KMP114002250",1589,"KMP214002250",2241,"KMP224002250",3006,"KMP334002250",4316,"KMP115002250",1919,"KMP215002250",2648,"KMP225002250",3589,"KMP335002250",5186]
[{"$f":"A75","v":2400},48,"KMP113002400",1322,"KMP213002400",1925,"KMP223002400",2527,"KMP333002400",3586,"KMP114002400",1694,"KMP214002400",2390,"KMP224002400",3206,"KMP334002400",4603,"KMP115002400",2047,"KMP215002400",2825,"KMP225002400",3828,"KMP335002400",5532]
[{"$f":"A76","v":2550},51,"KMP113002550",1405,"KMP213002550",2045,"KMP223002550",2685,"KMP333002550",3810,"KMP114002550",1800,"KMP214002550",2540,"KMP224002550",3407,"KMP334002550",4891,"KMP115002550",2175,"KMP215002550",3001,"KMP225002550",4067,"KMP335002550",5878]
[{"$f":"A77","v":2700},54,"KMP113002700",1488,"KMP213002700",2165,"KMP223002700",2843,"KMP333002700",4034,"KMP114002700",1906,"KMP214002700",2689,"KMP224002700",3607,"KMP334002700",5179,"KMP115002700",2303,"KMP215002700",3178,"KMP225002700",4307,"KMP335002700",6224]
[{"$f":"A78","v":3000},60,"KMP113003000",1653,"KMP213003000",2406,"KMP223003000",3159,"KMP333003000",4482,"KMP114003000",2118,"KMP214003000",2988,"KMP224003000",4008,"KMP334003000",5754,"KMP115003000",2559,"KMP215003000",3531,"KMP225003000",4785,"KMP335003000",6915]
[]
[]
["Hauteur",null,{"$f":"C81","v":600},null,null,null,null,null,null,null,{"$f":"K81","v":750},null,null,null,null,null,null,null,{"$f":"S81","v":900}]
["Type",null,{"$f":"C82","v":"KMP11"},null,{"$f":"E82","v":"KMP21"},null,{"$f":"G82","v":"KMP22"},null,{"$f":"I82","v":"KMP33"},null,{"$f":"K82","v":"KMP11"},null,{"$f":"M82","v":"KMP21"},null,{"$f":"O82","v":"KMP22"},null,{"$f":"Q82","v":"KMP33"},null,{"$f":"S82","v":"KMP11"},null,{"$f":"U82","v":"KMP21"},null,{"$f":"W82","v":"KMP22"},null,{"$f":"Y82","v":"KMP33"}]
["Longueur (mm)","Nombre éléments","Modèle","Puissance (watts)     ","Modèle","Puissance (watts)     ","Modèle","Puissance (watts)     ","Modèle","Puissance (watts)     ","Modèle","Puissance (watts)     ","Modèle","Puissance (watts)     ","Modèle","Puissance (watts)     ","Modèle","Puissance (watts)     ","Modèle","Puissance (watts)     ","Modèle","Puissance (watts)     ","Modèle","Puissance (watts)     ","Modèle","Puissance (watts)     "]
[{"$f":"A84","v":450},{"$f":"B84","v":9},{"$f":"C84","v":"KMP116000450"},{"$f":"IF(D84=\"\",\" - \",IF($B$6<0.7,D84*POWER($B$8/50,C$80),D84*POWER($B$7/50,C$80)))","v":446},{"$f":"E84","v":"KMP216000450"},{"$f":"IF(F84=\"\",\" - \",IF($B$6<0.7,F84*POWER($B$8/50,E$80),F84*POWER($B$7/50,E$80)))","v":607},{"$f":"G84","v":"KMP226000450"},{"$f":"IF(H84=\"\",\" - \",IF($B$6<0.7,H84*POWER($B$8/50,G$80),H84*POWER($B$7/50,G$80)))","v":824},{"$f":"I84","v":"KMP336000450"},{"$f":"IF(J84=\"\",\" - \",IF($B$6<0.7,J84*POWER($B$8/50,I$80),J84*POWER($B$7/50,I$80)))","v":1195},{"$f":"K84","v":"KMP117500450"},{"$f":"IF(L84=\"\",\" - \",IF($B$6<0.7,L84*POWER($B$8/50,K$80),L84*POWER($B$7/50,K$80)))","v":534},{"$f":"M84","v":"KMP217500450"},{"$f":"IF(N84=\"\",\" - \",IF($B$6<0.7,N84*POWER($B$8/50,M$80),N84*POWER($B$7/50,M$80)))","v":718},{"$f":"O84","v":"KMP227500450"},{"$f":"IF(P84=\"\",\" - \",IF($B$6<0.7,P84*POWER($B$8/50,O$80),P84*POWER($B$7/50,O$80)))","v":968},{"$f":"Q84","v":"KMP337500450"},{"$f":"IF(R84=\"\",\" - \",IF($B$6<0.7,R84*POWER($B$8/50,Q$80),R84*POWER($B$7/50,Q$80)))","v":1404},{"$f":"S84","v":"KMP119000450"},{"$f":"IF(T84=\"\",\" - \",IF($B$6<0.7,T84*POWER($B$8/50,S$80),T84*POWER($B$7/50,S$80)))","v":616},{"$f":"U84","v":"KMP219000450"},{"$f":"IF(V84=\"\",\" - \",IF($B$6<0.7,V84*POWER($B$8/50,U$80),V84*POWER($B$7/50,U$80)))","v":823},{"$f":"W84","v":"KMP229000450"},{"$f":"IF(X84=\"\",\" - \",IF($B$6<0.7,X84*POWER($B$8/50,W$80),X84*POWER($B$7/50,W$80)))","v":1092},{"$f":"Y84","v":"KMP339000450"},{"$f":"IF(Z84=\"\",\" - \",IF($B$6<0.7,Z84*POWER($B$8/50,Y$80),Z84*POWER($B$7/50,Y$80)))","v":1580}]
[{"$f":"A85","v":600},12,{"$f":"C85","v":"KMP116000600"},595,"KMP216000600",809,"KMP226000600",1099,"KMP336000600",1594,"KMP117500600",712,"KMP217500600",957,"KMP227500600",1290,"KMP337500600",1871,"KMP119000600",821,"KMP219000600",1097,"KMP229000600",1456,"KMP339000600",2107]
[{"$f":"A86","v":750},15,"KMP116000750",744,"KMP216000750",1012,"KMP226000750",1374,"KMP336000750",1992,"KMP117500750",890,"KMP217500750",1196,"KMP227500750",1613,"KMP337500750",2339,"KMP119000750",1026,"KMP219000750",1372,"KMP229000750",1820,"KMP339000750",2634]
[{"$f":"A87","v":900},18,"KMP116000900",893,"KMP216000900",1214,"KMP226000900",1649,"KMP336000900",2390,"KMP117500900",1068,"KMP217500900",1436,"KMP227500900",1935,"KMP337500900",2807,"KMP119000900",1231,"KMP219000900",1646,"KMP229000900",2184,"KMP339000900",3161]
[{"$f":"A88","v":1050},21,"KMP116001050",1042,"KMP216001050",1416,"KMP226001050",1924,"KMP336001050",2789,"KMP117501050",1246,"KMP217501050",1675,"KMP227501050",2258,"KMP337501050",3275,"KMP119001050",1436,"KMP219001050",1920,"KMP229001050",2548,"KMP339001050",3688]
[{"$f":"A89","v":1200},24,"KMP116001200",1190,"KMP216001200",1619,"KMP226001200",2198,"KMP336001200",3187,"KMP117501200",1424,"KMP217501200",1914,"KMP227501200",2580,"KMP337501200",3743,"KMP119001200",1642,"KMP219001200",2195,"KMP229001200",2912,"KMP339001200",4214]
[{"$f":"A90","v":1350},27,"KMP116001350",1339,"KMP216001350",1821,"KMP226001350",2473,"KMP336001350",3586,"KMP117501350",1602,"KMP217501350",2153,"KMP227501350",2903,"KMP337501350",4211,"KMP119001350",1847,"KMP219001350",2469,"KMP229001350",3276,"KMP339001350",4741]
[{"$f":"A91","v":1500},30,"KMP116001500",1488,"KMP216001500",2024,"KMP226001500",2748,"KMP336001500",3984,"KMP117501500",1781,"KMP217501500",2393,"KMP227501500",3225,"KMP337501500",4679,"KMP119001500",2052,"KMP219001500",2744,"KMP229001500",3641,"KMP339001500",5268]
[{"$f":"A92","v":1650},33,"KMP116001650",1637,"KMP216001650",2226,"KMP226001650",3023,"KMP336001650",4382,"KMP117501650",1959,"KMP217501650",2632,"KMP227501650",3548,"KMP337501650",5146,"KMP119001650",2257,"KMP219001650",3018,"KMP229001650",4005,"KMP339001650",5795]
[{"$f":"A93","v":1800},36,"KMP116001800",1786,"KMP216001800",2428,"KMP226001800",3298,"KMP336001800",4781,"KMP117501800",2137,"KMP217501800",2871,"KMP227501800",3870,"KMP337501800",5614,"KMP119001800",2462,"KMP219001800",3292,"KMP229001800",4369,"KMP339001800",6322]
[{"$f":"A94","v":1950},39,"KMP116001950",1934,"KMP216001950",2631,"KMP226001950",3572,"KMP336001950",5179,"KMP117501950",2315,"KMP217501950",3110,"KMP227501950",4193,"KMP337501950",6082,"KMP119001950",2668,"KMP219001950",3567,"KMP229001950",4733,"KMP339001950",6848]
[{"$f":"A95","v":2100},42,"KMP116002100",2083,"KMP216002100",2833,"KMP226002100",3847,"KMP336002100",5578,"KMP117502100",2493,"KMP217502100",3350,"KMP227502100",4515,"KMP337502100",6550,"KMP119002100",2873,"KMP219002100",3841,"KMP229002100",5097,"KMP339002100",7375]
[{"$f":"A96","v":2250},45,"KMP116002250",2232,"KMP216002250",3035,"KMP226002250",4122,"KMP336002250",5976,"KMP117502250",2671,"KMP217502250",3589,"KMP227502250",4838,"KMP337502250",7018,"KMP119002250",3078,"KMP219002250",4115,"KMP229002250",5461,"KMP339002250",7902]
[{"$f":"A97","v":2400},48,"KMP116002400",2381,"KMP216002400",3238,"KMP226002400",4397,"KMP336002400",6374,"KMP117502400",2849,"KMP217502400",3828,"KMP227502400",5160,"KMP337502400",7486,"KMP119002400",3283,"KMP219002400",4390,"KMP229002400",5825,"KMP339002400",8429]
[{"$f":"A98","v":2550},51,"KMP116002550",2530,"KMP216002550",3440,"KMP226002550",4672,"KMP336002550",6773,"KMP117502550",3027,"KMP217502550",4067,"KMP227502550",5483,"KMP337502550",7953,"KMP119002550",3488,"KMP219002550",4664,"KMP229002550",6189,"KMP339002550",8956]
[{"$f":"A99","v":2700},54,"KMP116002700",2678,"KMP216002700",3642,"KMP226002700",4946,"KMP336002700",7171,"KMP117502700",3205,"KMP217502700",4307,"KMP227502700",5805,"KMP337502700",8421,"KMP119002700",3694,"KMP219002700",4938,"KMP229002700",6553,"KMP339002700",9482]
[{"$f":"A100","v":3000},60,"KMP116003000",2976,"KMP216003000",4047,"KMP226003000",5496,"KMP336003000",7968,"KMP117503000",3561,"KMP217503000",4785,"KMP227503000",6450,"KMP337503000",9357,"KMP119003000",4104,"KMP219003000",5487,"KMP229003000",7281,"KMP339003000",10536]
[]
[]
[]
["Tableau de référence"]
[]
["PENTE :",null,1.3498000000000001,null,1.3668,null,1.3845000000000001,null,1.3768,null,1.3451,null,1.3620000000000001,null,1.3756999999999999,null,1.3651,null,1.3404,null,1.3572,null,1.3669,null,1.3532999999999999]
["Hauteur",null,300,null,null,null,null,null,null,null,400,null,null,null,null,null,null,null,500]
["Type",null,"KMP11",null,"KMP21",null,"KMP22",null,"KMP33",null,"KMP11",null,"KMP21",null,"KMP22",null,"KMP33",null,"KMP11",null,"KMP21",null,"KMP22",null,"KMP33"]
["Longueur (mm)","Nombre éléments","Modèle","Watt \nDt 50°C","Modèle","Watt \nDt 50°C","Modèle","Watt \nDt 50°C","Modèle","Watt \nDt 50°C","Modèle","Watt \nDt 50°C","Modèle","Watt \nDt 50°C","Modèle","Watt \nDt 50°C","Modèle","Watt \nDt 50°C","Modèle","Watt \nDt 50°C","Modèle","Watt \nDt 50°C","Modèle","Watt \nDt 50°C","Modèle","Watt \nDt 50°C"]
[450,{"$f":"A62/50","v":9},{"$f":"IF(D62=\"\",\" - \",IF(LEN($A62)=3,C$60&$C$59&\"0\"&$A62,C$60&$C$59&$A62))","v":"KMP113000450"},248,{"$f":"IF(F62=\"\",\" - \",IF(LEN($A62)=3,E$60&$C$59&\"0\"&$A62,E$60&$C$59&$A62))","v":"KMP213000450"},361,{"$f":"IF(H62=\"\",\" - \",IF(LEN($A62)=3,G$60&$C$59&\"0\"&$A62,G$60&$C$59&$A62))","v":"KMP223000450"},474,{"$f":"IF(J62=\"\",\" - \",IF(LEN($A62)=3,I$60&$C$59&\"0\"&$A62,I$60&$C$59&$A62))","v":"KMP333000450"},672,{"$f":"IF(L62=\"\",\" - \",IF(LEN($A62)=3,K$60&$K$59&\"0\"&$A62,K$60&$K$59&$A62))","v":"KMP114000450"},318,{"$f":"IF(N62=\"\",\" - \",IF(LEN($A62)=3,M$60&$K$59&\"0\"&$A62,M$60&$K$59&$A62))","v":"KMP214000450"},448,{"$f":"IF(P62=\"\",\" - \",IF(LEN($A62)=3,O$60&$K$59&\"0\"&$A62,O$60&$K$59&$A62))","v":"KMP224000450"},601,{"$f":"IF(R62=\"\",\" - \",IF(LEN($A62)=3,Q$60&$K$59&\"0\"&$A62,Q$60&$K$59&$A62))","v":"KMP334000450"},863,{"$f":"IF(T62=\"\",\" - \",IF(LEN($A62)=3,S$60&$S$59&\"0\"&$A62,S$60&$S$59&$A62))","v":"KMP115000450"},384,{"$f":"IF(V62=\"\",\" - \",IF(LEN($A62)=3,U$60&$S$59&\"0\"&$A62,U$60&$S$59&$A62))","v":"KMP215000450"},530,{"$f":"IF(X62=\"\",\" - \",IF(LEN($A62)=3,W$60&$S$59&\"0\"&$A62,W$60&$S$59&$A62))","v":"KMP225000450"},718,{"$f":"IF(Z62=\"\",\" - \",IF(LEN($A62)=3,Y$60&$S$59&\"0\"&$A62,Y$60&$S$59&$A62))","v":"KMP335000450"},1037]
[600,{"$f":"A63/50","v":12},"KMP113000600",331,"KMP213000600",481,"KMP223000600",632,"KMP333000600",896,"KMP114000600",424,"KMP214000600",598,"KMP224000600",802,"KMP334000600",1151,"KMP115000600",512,"KMP215000600",706,"KMP225000600",957,"KMP335000600",1383]
[750,15,"KMP113000750",413,"KMP213000750",602,"KMP223000750",790,"KMP333000750",1121,"KMP114000750",530,"KMP214000750",747,"KMP224000750",1002,"KMP334000750",1439,"KMP115000750",640,"KMP215000750",883,"KMP225000750",1196,"KMP335000750",1729]
[900,18,"KMP113000900",496,"KMP213000900",722,"KMP223000900",948,"KMP333000900",1345,"KMP114000900",635,"KMP214000900",896,"KMP224000900",1202,"KMP334000900",1726,"KMP115000900",768,"KMP215000900",1059,"KMP225000900",1436,"KMP335000900",2075]
[1050,21,"KMP113001050",579,"KMP213001050",842,"KMP223001050",1106,"KMP333001050",1569,"KMP114001050",741,"KMP214001050",1046,"KMP224001050",1403,"KMP334001050",2014,"KMP115001050",896,"KMP215001050",1236,"KMP225001050",1675,"KMP335001050",2420]
[1200,24,"KMP113001200",661,"KMP213001200",962,"KMP223001200",1264,"KMP333001200",1793,"KMP114001200",847,"KMP214001200",1195,"KMP224001200",1603,"KMP334001200",2302,"KMP115001200",1024,"KMP215001200",1412,"KMP225001200",1914,"KMP335001200",2766]
[1350,27,"KMP113001350",744,"KMP213001350",1083,"KMP223001350",1422,"KMP333001350",2017,"KMP114001350",953,"KMP214001350",1345,"KMP224001350",1804,"KMP334001350",2589,"KMP115001350",1152,"KMP215001350",1589,"KMP225001350",2153,"KMP335001350",3112]
[1500,30,"KMP113001500",827,"KMP213001500",1203,"KMP223001500",1580,"KMP333001500",2241,"KMP114001500",1059,"KMP214001500",1494,"KMP224001500",2004,"KMP334001500",2877,"KMP115001500",1280,"KMP215001500",1766,"KMP225001500",2393,"KMP335001500",3458]
[1650,33,"KMP113001650",909,"KMP213001650",1323,"KMP223001650",1737,"KMP333001650",2465,"KMP114001650",1165,"KMP214001650",1643,"KMP224001650",2204,"KMP334001650",3165,"KMP115001650",1407,"KMP215001650",1942,"KMP225001650",2632,"KMP335001650",3803]
[1800,36,"KMP113001800",992,"KMP213001800",1444,"KMP223001800",1895,"KMP333001800",2689,"KMP114001800",1271,"KMP214001800",1793,"KMP224001800",2405,"KMP334001800",3452,"KMP115001800",1535,"KMP215001800",2119,"KMP225001800",2871,"KMP335001800",4149]
[1950,39,"KMP113001950",1074,"KMP213001950",1564,"KMP223001950",2053,"KMP333001950",2913,"KMP114001950",1377,"KMP214001950",1942,"KMP224001950",2605,"KMP334001950",3740,"KMP115001950",1663,"KMP215001950",2295,"KMP225001950",3110,"KMP335001950",4495]
[2100,42,"KMP113002100",1157,"KMP213002100",1684,"KMP223002100",2211,"KMP333002100",3137,"KMP114002100",1483,"KMP214002100",2092,"KMP224002100",2806,"KMP334002100",4028,"KMP115002100",1791,"KMP215002100",2472,"KMP225002100",3350,"KMP335002100",4841]
[2250,45,"KMP113002250",1240,"KMP213002250",1805,"KMP223002250",2369,"KMP333002250",3362,"KMP114002250",1589,"KMP214002250",2241,"KMP224002250",3006,"KMP334002250",4316,"KMP115002250",1919,"KMP215002250",2648,"KMP225002250",3589,"KMP335002250",5186]
[2400,48,"KMP113002400",1322,"KMP213002400",1925,"KMP223002400",2527,"KMP333002400",3586,"KMP114002400",1694,"KMP214002400",2390,"KMP224002400",3206,"KMP334002400",4603,"KMP115002400",2047,"KMP215002400",2825,"KMP225002400",3828,"KMP335002400",5532]
[2550,51,"KMP113002550",1405,"KMP213002550",2045,"KMP223002550",2685,"KMP333002550",3810,"KMP114002550",1800,"KMP214002550",2540,"KMP224002550",3407,"KMP334002550",4891,"KMP115002550",2175,"KMP215002550",3001,"KMP225002550",4067,"KMP335002550",5878]
[2700,54,"KMP113002700",1488,"KMP213002700",2165,"KMP223002700",2843,"KMP333002700",4034,"KMP114002700",1906,"KMP214002700",2689,"KMP224002700",3607,"KMP334002700",5179,"KMP115002700",2303,"KMP215002700",3178,"KMP225002700",4307,"KMP335002700",6224]
[3000,60,"KMP113003000",1653,"KMP213003000",2406,"KMP223003000",3159,"KMP333003000",4482,"KMP114003000",2118,"KMP214003000",2988,"KMP224003000",4008,"KMP334003000",5754,"KMP115003000",2559,"KMP215003000",3531,"KMP225003000",4785,"KMP335003000",6915]
[]
["PENTE :",null,1.3357000000000001,null,1.3523000000000001,null,1.3581000000000001,null,1.3414999999999999,null,1.3287,null,1.3451,null,1.3449,null,1.3238000000000001,null,1.3217000000000001,null,1.3379000000000001,null,1.3315999999999999,null,1.3061,null,null,null,null,null,1.3540000000000001]
["Hauteur",null,600,null,null,null,null,null,null,null,750,null,null,null,null,null,null,null,900]
["Type",null,"KMP11",null,"KMP21",null,"KMP22",null,"KMP33",null,"KMP11",null,"KMP21",null,"KMP22",null,"KMP33",null,"KMP11",null,"KMP21",null,"KMP22",null,"KMP33"]
["Longueur (mm)","Nombre éléments","Modèle","Watt \nDt 50°C","Modèle","Watt \nDt 50°C","Modèle","Watt \nDt 50°C","Modèle","Watt \nDt 50°C","Modèle","Watt \nDt 50°C","Modèle","Watt \nDt 50°C","Modèle","Watt \nDt 50°C","Modèle","Watt \nDt 50°C","Modèle","Watt \nDt 50°C","Modèle","Watt \nDt 50°C","Modèle","Watt \nDt 50°C","Modèle","Watt \nDt 50°C"]
[450,{"$f":"A84/50","v":9},{"$f":"IF(D84=\"\",\" - \",IF(LEN($A84)=3,C$82&$C$81&\"0\"&$A84,C$82&$C$81&$A84))","v":"KMP116000450"},446,{"$f":"IF(F84=\"\",\" - \",IF(LEN($A84)=3,E$82&$C$81&\"0\"&$A84,E$82&$C$81&$A84))","v":"KMP216000450"},607,{"$f":"IF(H84=\"\",\" - \",IF(LEN($A84)=3,G$82&$C$81&\"0\"&$A84,G$82&$C$81&$A84))","v":"KMP226000450"},824,{"$f":"IF(J84=\"\",\" - \",IF(LEN($A84)=3,I$82&$C$81&\"0\"&$A84,I$82&$C$81&$A84))","v":"KMP336000450"},1195,{"$f":"IF(L84=\"\",\" - \",IF(LEN($A84)=3,K$82&$K$81&\"0\"&$A84,K$82&$K$81&$A84))","v":"KMP117500450"},534,{"$f":"IF(N84=\"\",\" - \",IF(LEN($A84)=3,M$82&$K$81&\"0\"&$A84,M$82&$K$81&$A84))","v":"KMP217500450"},718,{"$f":"IF(P84=\"\",\" - \",IF(LEN($A84)=3,O$82&$K$81&\"0\"&$A84,O$82&$K$81&$A84))","v":"KMP227500450"},968,{"$f":"IF(R84=\"\",\" - \",IF(LEN($A84)=3,Q$82&$K$81&\"0\"&$A84,Q$82&$K$81&$A84))","v":"KMP337500450"},1404,{"$f":"IF(T84=\"\",\" - \",IF(LEN($A84)=3,S$82&$S$81&\"0\"&$A84,S$82&$S$81&$A84))","v":"KMP119000450"},616,{"$f":"IF(V84=\"\",\" - \",IF(LEN($A84)=3,U$82&$S$81&\"0\"&$A84,U$82&$S$81&$A84))","v":"KMP219000450"},823,{"$f":"IF(X84=\"\",\" - \",IF(LEN($A84)=3,W$82&$S$81&\"0\"&$A84,W$82&$S$81&$A84))","v":"KMP229000450"},1092,{"$f":"IF(Z84=\"\",\" - \",IF(LEN($A84)=3,Y$82&$S$81&\"0\"&$A84,Y$82&$S$81&$A84))","v":"KMP339000450"},1580]
[600,{"$f":"A85/50","v":12},"KMP116000600",595,"KMP216000600",809,"KMP226000600",1099,"KMP336000600",1594,"KMP117500600",712,"KMP217500600",957,"KMP227500600",1290,"KMP337500600",1871,"KMP119000600",821,"KMP219000600",1097,"KMP229000600",1456,"KMP339000600",2107]
[750,15,"KMP116000750",744,"KMP216000750",1012,"KMP226000750",1374,"KMP336000750",1992,"KMP117500750",890,"KMP217500750",1196,"KMP227500750",1613,"KMP337500750",2339,"KMP119000750",1026,"KMP219000750",1372,"KMP229000750",1820,"KMP339000750",2634]
[900,18,"KMP116000900",893,"KMP216000900",1214,"KMP226000900",1649,"KMP336000900",2390,"KMP117500900",1068,"KMP217500900",1436,"KMP227500900",1935,"KMP337500900",2807,"KMP119000900",1231,"KMP219000900",1646,"KMP229000900",2184,"KMP339000900",3161]
[1050,21,"KMP116001050",1042,"KMP216001050",1416,"KMP226001050",1924,"KMP336001050",2789,"KMP117501050",1246,"KMP217501050",1675,"KMP227501050",2258,"KMP337501050",3275,"KMP119001050",1436,"KMP219001050",1920,"KMP229001050",2548,"KMP339001050",3688]
[1200,24,"KMP116001200",1190,"KMP216001200",1619,"KMP226001200",2198,"KMP336001200",3187,"KMP117501200",1424,"KMP217501200",1914,"KMP227501200",2580,"KMP337501200",3743,"KMP119001200",1642,"KMP219001200",2195,"KMP229001200",2912,"KMP339001200",4214]
[1350,27,"KMP116001350",1339,"KMP216001350",1821,"KMP226001350",2473,"KMP336001350",3586,"KMP117501350",1602,"KMP217501350",2153,"KMP227501350",2903,"KMP337501350",4211,"KMP119001350",1847,"KMP219001350",2469,"KMP229001350",3276,"KMP339001350",4741]
[1500,30,"KMP116001500",1488,"KMP216001500",2024,"KMP226001500",2748,"KMP336001500",3984,"KMP117501500",1781,"KMP217501500",2393,"KMP227501500",3225,"KMP337501500",4679,"KMP119001500",2052,"KMP219001500",2744,"KMP229001500",3641,"KMP339001500",5268]
[1650,33,"KMP116001650",1637,"KMP216001650",2226,"KMP226001650",3023,"KMP336001650",4382,"KMP117501650",1959,"KMP217501650",2632,"KMP227501650",3548,"KMP337501650",5146,"KMP119001650",2257,"KMP219001650",3018,"KMP229001650",4005,"KMP339001650",5795]
[1800,36,"KMP116001800",1786,"KMP216001800",2428,"KMP226001800",3298,"KMP336001800",4781,"KMP117501800",2137,"KMP217501800",2871,"KMP227501800",3870,"KMP337501800",5614,"KMP119001800",2462,"KMP219001800",3292,"KMP229001800",4369,"KMP339001800",6322]
[1950,39,"KMP116001950",1934,"KMP216001950",2631,"KMP226001950",3572,"KMP336001950",5179,"KMP117501950",2315,"KMP217501950",3110,"KMP227501950",4193,"KMP337501950",6082,"KMP119001950",2668,"KMP219001950",3567,"KMP229001950",4733,"KMP339001950",6848]
[2100,42,"KMP116002100",2083,"KMP216002100",2833,"KMP226002100",3847,"KMP336002100",5578,"KMP117502100",2493,"KMP217502100",3350,"KMP227502100",4515,"KMP337502100",6550,"KMP119002100",2873,"KMP219002100",3841,"KMP229002100",5097,"KMP339002100",7375]
[2250,45,"KMP116002250",2232,"KMP216002250",3035,"KMP226002250",4122,"KMP336002250",5976,"KMP117502250",2671,"KMP217502250",3589,"KMP227502250",4838,"KMP337502250",7018,"KMP119002250",3078,"KMP219002250",4115,"KMP229002250",5461,"KMP339002250",7902]
[2400,48,"KMP116002400",2381,"KMP216002400",3238,"KMP226002400",4397,"KMP336002400",6374,"KMP117502400",2849,"KMP217502400",3828,"KMP227502400",5160,"KMP337502400",7486,"KMP119002400",3283,"KMP219002400",4390,"KMP229002400",5825,"KMP339002400",8429]
[2550,51,"KMP116002550",2530,"KMP216002550",3440,"KMP226002550",4672,"KMP336002550",6773,"KMP117502550",3027,"KMP217502550",4067,"KMP227502550",5483,"KMP337502550",7953,"KMP119002550",3488,"KMP219002550",4664,"KMP229002550",6189,"KMP339002550",8956]
[2700,54,"KMP116002700",2678,"KMP216002700",3642,"KMP226002700",4946,"KMP336002700",7171,"KMP117502700",3205,"KMP217502700",4307,"KMP227502700",5805,"KMP337502700",8421,"KMP119002700",3694,"KMP219002700",4938,"KMP229002700",6553,"KMP339002700",9482]
[3000,60,"KMP116003000",2976,"KMP216003000",4047,"KMP226003000",5496,"KMP336003000",7968,"KMP117503000",3561,"KMP217503000",4785,"KMP227503000",6450,"KMP337503000",9357,"KMP119003000",4104,"KMP219003000",5487,"KMP229003000",7281,"KMP339003000",10536]

{"sheet":"E-FLOW","index":3,"n_rows":100,"n_cols":44,"rows_kept":100,"cut":false,"hidden":false,"merged":[[81,24,81,25],[81,12,81,13],[81,14,81,15],[81,16,81,17],[81,18,81,19],[81,20,81,21],[81,22,81,23],[81,0,81,1],[81,2,81,3],[81,4,81,5],[81,6,81,7],[81,8,81,9],[81,10,81,11],[79,16,79,17],[79,18,79,19],[79,20,79,21],[79,22,79,23],[79,24,79,25],[80,0,80,1],[80,2,80,9],[80,10,80,17],[80,18,80,25],[59,22,59,23],[59,24,59,25],[79,0,79,1],[79,2,79,3],[79,4,79,5],[79,6,79,7],[79,8,79,9],[79,10,79,11],[79,12,79,13],[79,14,79,15],[59,10,59,11],[59,12,59,13],[59,14,59,15],[59,16,59,17],[59,18,59,19],[59,20,59,21],[57,22,57,23],[57,0,57,1],[57,2,57,3],[57,4,57,5],[57,6,57,7],[57,8,57,9],[57,10,57,11],[33,20,33,21],[33,22,33,23],[59,0,59,1],[59,2,59,3],[59,4,59,5],[59,6,59,7],[59,8,59,9],[58,0,58,1],[58,2,58,9],[58,10,58,17],[58,18,58,25],[57,12,57,13],[57,14,57,15],[57,16,57,17],[57,18,57,19],[57,20,57,21],[33,10,33,11],[57,24,57,25],[32,0,32,1],[32,2,32,9],[32,10,32,17],[32,18,32,25],[33,0,33,1],[33,2,33,3],[33,4,33,5],[33,6,33,7],[33,8,33,9],[33,24,33,25],[33,12,33,13],[33,14,33,15],[33,16,33,17],[33,18,33,19],[10,0,10,1],[11,10,11,11],[11,12,11,13],[11,14,11,15],[11,16,11,17],[10,10,10,17],[11,0,11,1],[11,2,11,3],[11,4,11,5],[11,6,11,7],[11,8,11,9],[10,2,10,9],[2,2,2,6],[3,2,3,6],[4,2,4,6],[10,18,10,25],[11,18,11,19],[11,20,11,21],[11,22,11,23],[11,24,11,25]]}
["Programme de calcul de la puissance thermique: E-FLOW"]
[]
["Te",75,"<= Entrez la température à l'entrée en C°"]
["Ts",65,"<= Entrez la température à la sortie en C°"]
["Ti",20,"<= Entrez la température ambiante en C°"]
["Rapport",{"$f":"(B4-B5)/(B3-B5)","v":0.81818181818181823}]
["Delta T",{"$f":"((B3+B4)/2)-B5","v":50}]
["Delta T2",{"$f":"(B3-B4)/LN((B3-B5)/(B4-B5))","v":49.83288654563971},"Si Rapport < 0,7"]
[]
[]
["Hauteur",null,{"$f":"C59","v":300},null,null,null,null,null,null,null,{"$f":"K59","v":400},null,null,null,null,null,null,null,{"$f":"S59","v":500}]
["Type",null,{"$f":"C60","v":"EIN11"},null,{"$f":"E60","v":"EIN21"},null,{"$f":"G60","v":"EIN22"},null,{"$f":"I60","v":"EIN33"},null,{"$f":"K60","v":"EIN11"},null,{"$f":"M60","v":"EIN21"},null,{"$f":"O60","v":"EIN22"},null,{"$f":"Q60","v":"EIN33"},null,{"$f":"S60","v":"EIN11"},null,{"$f":"U60","v":"EIN21"},null,{"$f":"W60","v":"EIN22"},null,{"$f":"Y60","v":"EIN33"}]
["Longueur (mm)","Nombre éléments","Modèle","Puissance (watts)     ","Modèle","Puissance (watts)     ","Modèle","Puissance (watts)     ","Modèle","Puissance (watts)     ","Modèle","Puissance (watts)     ","Modèle","Puissance (watts)     ","Modèle","Puissance (watts)     ","Modèle","Puissance (watts)     ","Modèle","Puissance (watts)     ","Modèle","Puissance (watts)     ","Modèle","Puissance (watts)     ","Modèle","Puissance (watts)     "]
[{"$f":"A62","v":450},{"$f":"B62","v":9},{"$f":"C62","v":"EIN113000450"},{"$f":"IF(D62=\"\",\" - \",IF($B$6<0.7,D62*POWER($B$8/50,C$58),D62*POWER($B$7/50,C$58)))","v":248},{"$f":"E62","v":"EIN213000450"},{"$f":"IF(F62=\"\",\" - \",IF($B$6<0.7,F62*POWER($B$8/50,E$58),F62*POWER($B$7/50,E$58)))","v":361},{"$f":"G62","v":"EIN223000450"},{"$f":"IF(H62=\"\",\" - \",IF($B$6<0.7,H62*POWER($B$8/50,G$58),H62*POWER($B$7/50,G$58)))","v":474},{"$f":"I62","v":"EIN333000450"},{"$f":"IF(J62=\"\",\" - \",IF($B$6<0.7,J62*POWER($B$8/50,I$58),J62*POWER($B$7/50,I$58)))","v":672},{"$f":"K62","v":"EIN114000450"},{"$f":"IF(L62=\"\",\" - \",IF($B$6<0.7,L62*POWER($B$8/50,K$58),L62*POWER($B$7/50,K$58)))","v":318},{"$f":"M62","v":"EIN214000450"},{"$f":"IF(N62=\"\",\" - \",IF($B$6<0.7,N62*POWER($B$8/50,M$58),N62*POWER($B$7/50,M$58)))","v":448},{"$f":"O62","v":"EIN224000450"},{"$f":"IF(P62=\"\",\" - \",IF($B$6<0.7,P62*POWER($B$8/50,O$58),P62*POWER($B$7/50,O$58)))","v":601},{"$f":"Q62","v":"EIN334000450"},{"$f":"IF(R62=\"\",\" - \",IF($B$6<0.7,R62*POWER($B$8/50,Q$58),R62*POWER($B$7/50,Q$58)))","v":863},{"$f":"S62","v":"EIN115000450"},{"$f":"IF(T62=\"\",\" - \",IF($B$6<0.7,T62*POWER($B$8/50,S$58),T62*POWER($B$7/50,S$58)))","v":384},{"$f":"U62","v":"EIN215000450"},{"$f":"IF(V62=\"\",\" - \",IF($B$6<0.7,V62*POWER($B$8/50,U$58),V62*POWER($B$7/50,U$58)))","v":530},{"$f":"W62","v":"EIN225000450"},{"$f":"IF(X62=\"\",\" - \",IF($B$6<0.7,X62*POWER($B$8/50,W$58),X62*POWER($B$7/50,W$58)))","v":718},{"$f":"Y62","v":"EIN335000450"},{"$f":"IF(Z62=\"\",\" - \",IF($B$6<0.7,Z62*POWER($B$8/50,Y$58),Z62*POWER($B$7/50,Y$58)))","v":1037},null,null,null,null,null,null,null,null,null,null,null,null,null,","]
[{"$f":"A63","v":600},12,"EIN113000600",{"$f":"IF(D63=\"\",\" - \",IF($B$6<0.7,D63*POWER($B$8/50,C$58),D63*POWER($B$7/50,C$58)))","v":331},{"$f":"E63","v":"EIN213000600"},{"$f":"IF(F63=\"\",\" - \",IF($B$6<0.7,F63*POWER($B$8/50,E$58),F63*POWER($B$7/50,E$58)))","v":481},{"$f":"G63","v":"EIN223000600"},{"$f":"IF(H63=\"\",\" - \",IF($B$6<0.7,H63*POWER($B$8/50,G$58),H63*POWER($B$7/50,G$58)))","v":632},{"$f":"I63","v":"EIN333000600"},{"$f":"IF(J63=\"\",\" - \",IF($B$6<0.7,J63*POWER($B$8/50,I$58),J63*POWER($B$7/50,I$58)))","v":896},{"$f":"K63","v":"EIN114000600"},{"$f":"IF(L63=\"\",\" - \",IF($B$6<0.7,L63*POWER($B$8/50,K$58),L63*POWER($B$7/50,K$58)))","v":424},{"$f":"M63","v":"EIN214000600"},{"$f":"IF(N63=\"\",\" - \",IF($B$6<0.7,N63*POWER($B$8/50,M$58),N63*POWER($B$7/50,M$58)))","v":598},{"$f":"O63","v":"EIN224000600"},{"$f":"IF(P63=\"\",\" - \",IF($B$6<0.7,P63*POWER($B$8/50,O$58),P63*POWER($B$7/50,O$58)))","v":802},{"$f":"Q63","v":"EIN334000600"},{"$f":"IF(R63=\"\",\" - \",IF($B$6<0.7,R63*POWER($B$8/50,Q$58),R63*POWER($B$7/50,Q$58)))","v":1151},{"$f":"S63","v":"EIN115000600"},{"$f":"IF(T63=\"\",\" - \",IF($B$6<0.7,T63*POWER($B$8/50,S$58),T63*POWER($B$7/50,S$58)))","v":512},{"$f":"U63","v":"EIN215000600"},{"$f":"IF(V63=\"\",\" - \",IF($B$6<0.7,V63*POWER($B$8/50,U$58),V63*POWER($B$7/50,U$58)))","v":706},{"$f":"W63","v":"EIN225000600"},{"$f":"IF(X63=\"\",\" - \",IF($B$6<0.7,X63*POWER($B$8/50,W$58),X63*POWER($B$7/50,W$58)))","v":957},{"$f":"Y63","v":"EIN335000600"},{"$f":"IF(Z63=\"\",\" - \",IF($B$6<0.7,Z63*POWER($B$8/50,Y$58),Z63*POWER($B$7/50,Y$58)))","v":1383}]
[750,15,"EIN113000750",413,"EIN213000750",602,"EIN223000750",790,"EIN333000750",1121,"EIN114000750",530,"EIN214000750",747,"EIN224000750",1002,"EIN334000750",1439,"EIN115000750",640,"EIN215000750",883,"EIN225000750",1196,"EIN335000750",1729]
[900,18,"EIN113000900",496,"EIN213000900",722,"EIN223000900",948,"EIN333000900",1345,"EIN114000900",635,"EIN214000900",896,"EIN224000900",1202,"EIN334000900",1726,"EIN115000900",768,"EIN215000900",1059,"EIN225000900",1436,"EIN335000900",2075]
[1050,21,"EIN113001050",579,"EIN213001050",842,"EIN223001050",1106,"EIN333001050",1569,"EIN114001050",741,"EIN214001050",1046,"EIN224001050",1403,"EIN334001050",2014,"EIN115001050",896,"EIN215001050",1236,"EIN225001050",1675,"EIN335001050",2420]
[1200,24,"EIN113001200",661,"EIN213001200",962,"EIN223001200",1264,"EIN333001200",1793,"EIN114001200",847,"EIN214001200",1195,"EIN224001200",1603,"EIN334001200",2302,"EIN115001200",1024,"EIN215001200",1412,"EIN225001200",1914,"EIN335001200",2766]
[1350,27,"EIN113001350",744,"EIN213001350",1083,"EIN223001350",1422,"EIN333001350",2017,"EIN114001350",953,"EIN214001350",1345,"EIN224001350",1804,"EIN334001350",2589,"EIN115001350",1152,"EIN215001350",1589,"EIN225001350",2153,"EIN335001350",3112]
[1500,30,"EIN113001500",827,"EIN213001500",1203,"EIN223001500",1580,"EIN333001500",2241,"EIN114001500",1059,"EIN214001500",1494,"EIN224001500",2004,"EIN334001500",2877,"EIN115001500",1280,"EIN215001500",1766,"EIN225001500",2393,"EIN335001500",3458]
[1650,33,"EIN113001650",909,"EIN213001650",1323,"EIN223001650",1737,"EIN333001650",2465,"EIN114001650",1165,"EIN214001650",1643,"EIN224001650",2204,"EIN334001650",3165,"EIN115001650",1407,"EIN215001650",1942,"EIN225001650",2632,"EIN335001650",3803]
[1800,36,"EIN113001800",992,"EIN213001800",1444,"EIN223001800",1895,"EIN333001800",2689,"EIN114001800",1271,"EIN214001800",1793,"EIN224001800",2405,"EIN334001800",3452,"EIN115001800",1535,"EIN215001800",2119,"EIN225001800",2871,"EIN335001800",4149]
[1950,39," - "," - ","EIN213001950",1564,"EIN223001950",2053,"EIN333001950",2913," - "," - ","EIN214001950",1942,"EIN224001950",2605,"EIN334001950",3740," - "," - ","EIN215001950",2295,"EIN225001950",3110,"EIN335001950",4495]
[2100,42," - "," - ","EIN213002100",1684,"EIN223002100",2211,"EIN333002100",3137," - "," - ","EIN214002100",2092,"EIN224002100",2806,"EIN334002100",4028," - "," - ","EIN215002100",2472,"EIN225002100",3350,"EIN335002100",4841]
[2250,45," - "," - ","EIN213002250",1805,"EIN223002250",2369,"EIN333002250",3362," - "," - ","EIN214002250",2241,"EIN224002250",3006,"EIN334002250",4316," - "," - ","EIN215002250",2648,"EIN225002250",3589,"EIN335002250",5186]
[2400,48," - "," - ","EIN213002400",1925,"EIN223002400",2527,"EIN333002400",3586," - "," - ","EIN214002400",2390,"EIN224002400",3206,"EIN334002400",4603," - "," - ","EIN215002400",2825,"EIN225002400",3828,"EIN335002400",5532]
[2550,51," - "," - ","EIN213002550",2045,"EIN223002550",2685,"EIN333002550",3810," - "," - ","EIN214002550",2540,"EIN224002550",3407,"EIN334002550",4891," - "," - ","EIN215002550",3001,"EIN225002550",4067,"EIN335002550",5878]
[2700,54," - "," - ","EIN213002700",2165,"EIN223002700",2843,"EIN333002700",4034," - "," - ","EIN214002700",2689,"EIN224002700",3607,"EIN334002700",5179," - "," - ","EIN215002700",3178,"EIN225002700",4307,"EIN335002700",6224]
[3000,60," - "," - ","EIN213003000",2406,"EIN223003000",3159,"EIN333003000",4482," - "," - ","EIN214003000",2988,"EIN224003000",4008,"EIN334003000",5754," - "," - ","EIN215003000",3531,"EIN225003000",4785,"EIN335003000",6915]
[]
[]
["Hauteur",null,{"$f":"C81","v":600},null,null,null,null,null,null,null,{"$f":"K81","v":750},null,null,null,null,null,null,null,{"$f":"S81","v":900}]
["Type",null,{"$f":"C82","v":"EIN11"},null,{"$f":"E82","v":"EIN21"},null,{"$f":"G82","v":"EIN22"},null,{"$f":"I82","v":"EIN33"},null,{"$f":"K82","v":"EIN11"},null,{"$f":"M82","v":"EIN21"},null,{"$f":"O82","v":"EIN22"},null,{"$f":"Q82","v":"EIN33"},null,{"$f":"S82","v":"EIN11"},null,{"$f":"U82","v":"EIN21"},null,{"$f":"W82","v":"EIN22"},null,{"$f":"Y82","v":"EIN33"}]
["Longueur (mm)","Nombre éléments","Modèle","Puissance (watts)     ","Modèle","Puissance (watts)     ","Modèle","Puissance (watts)     ","Modèle","Puissance (watts)     ","Modèle","Puissance (watts)     ","Modèle","Puissance (watts)     ","Modèle","Puissance (watts)     ","Modèle","Puissance (watts)     ","Modèle","Puissance (watts)     ","Modèle","Puissance (watts)     ","Modèle","Puissance (watts)     ","Modèle","Puissance (watts)     "]
[{"$f":"A84","v":450},{"$f":"B84","v":9},{"$f":"C84","v":"EIN116000450"},{"$f":"IF(D84=\"\",\" - \",IF($B$6<0.7,D84*POWER($B$8/50,C$80),D84*POWER($B$7/50,C$80)))","v":446},{"$f":"E84","v":"EIN216000450"},{"$f":"IF(F84=\"\",\" - \",IF($B$6<0.7,F84*POWER($B$8/50,E$80),F84*POWER($B$7/50,E$80)))","v":607},{"$f":"G84","v":"EIN226000450"},{"$f":"IF(H84=\"\",\" - \",IF($B$6<0.7,H84*POWER($B$8/50,G$80),H84*POWER($B$7/50,G$80)))","v":824},{"$f":"I84","v":"EIN336000450"},{"$f":"IF(J84=\"\",\" - \",IF($B$6<0.7,J84*POWER($B$8/50,I$80),J84*POWER($B$7/50,I$80)))","v":1195},{"$f":"K84","v":"EIN117500450"},{"$f":"IF(L84=\"\",\" - \",IF($B$6<0.7,L84*POWER($B$8/50,K$80),L84*POWER($B$7/50,K$80)))","v":534},{"$f":"M84","v":"EIN217500450"},{"$f":"IF(N84=\"\",\" - \",IF($B$6<0.7,N84*POWER($B$8/50,M$80),N84*POWER($B$7/50,M$80)))","v":718},{"$f":"O84","v":"EIN227500450"},{"$f":"IF(P84=\"\",\" - \",IF($B$6<0.7,P84*POWER($B$8/50,O$80),P84*POWER($B$7/50,O$80)))","v":968},{"$f":"Q84","v":"EIN337500450"},{"$f":"IF(R84=\"\",\" - \",IF($B$6<0.7,R84*POWER($B$8/50,Q$80),R84*POWER($B$7/50,Q$80)))","v":1404},{"$f":"S84","v":"EIN119000450"},{"$f":"IF(T84=\"\",\" - \",IF($B$6<0.7,T84*POWER($B$8/50,S$80),T84*POWER($B$7/50,S$80)))","v":616},{"$f":"U84","v":"EIN219000450"},{"$f":"IF(V84=\"\",\" - \",IF($B$6<0.7,V84*POWER($B$8/50,U$80),V84*POWER($B$7/50,U$80)))","v":823},{"$f":"W84","v":"EIN229000450"},{"$f":"IF(X84=\"\",\" - \",IF($B$6<0.7,X84*POWER($B$8/50,W$80),X84*POWER($B$7/50,W$80)))","v":1092},{"$f":"Y84","v":"EIN339000450"},{"$f":"IF(Z84=\"\",\" - \",IF($B$6<0.7,Z84*POWER($B$8/50,Y$80),Z84*POWER($B$7/50,Y$80)))","v":1580}]
[{"$f":"A85","v":600},12,{"$f":"C85","v":"EIN116000600"},{"$f":"IF(D85=\"\",\" - \",IF($B$6<0.7,D85*POWER($B$8/50,C$80),D85*POWER($B$7/50,C$80)))","v":595},"EIN216000600",{"$f":"IF(F85=\"\",\" - \",IF($B$6<0.7,F85*POWER($B$8/50,E$80),F85*POWER($B$7/50,E$80)))","v":809},"EIN226000600",{"$f":"IF(H85=\"\",\" - \",IF($B$6<0.7,H85*POWER($B$8/50,G$80),H85*POWER($B$7/50,G$80)))","v":1099},"EIN336000600",{"$f":"IF(J85=\"\",\" - \",IF($B$6<0.7,J85*POWER($B$8/50,I$80),J85*POWER($B$7/50,I$80)))","v":1594},"EIN117500600",{"$f":"IF(L85=\"\",\" - \",IF($B$6<0.7,L85*POWER($B$8/50,K$80),L85*POWER($B$7/50,K$80)))","v":712},"EIN217500600",{"$f":"IF(N85=\"\",\" - \",IF($B$6<0.7,N85*POWER($B$8/50,M$80),N85*POWER($B$7/50,M$80)))","v":957},"EIN227500600",{"$f":"IF(P85=\"\",\" - \",IF($B$6<0.7,P85*POWER($B$8/50,O$80),P85*POWER($B$7/50,O$80)))","v":1290},"EIN337500600",{"$f":"IF(R85=\"\",\" - \",IF($B$6<0.7,R85*POWER($B$8/50,Q$80),R85*POWER($B$7/50,Q$80)))","v":1871},"EIN119000600",{"$f":"IF(T85=\"\",\" - \",IF($B$6<0.7,T85*POWER($B$8/50,S$80),T85*POWER($B$7/50,S$80)))","v":821},"EIN219000600",{"$f":"IF(V85=\"\",\" - \",IF($B$6<0.7,V85*POWER($B$8/50,U$80),V85*POWER($B$7/50,U$80)))","v":1097},"EIN229000600",{"$f":"IF(X85=\"\",\" - \",IF($B$6<0.7,X85*POWER($B$8/50,W$80),X85*POWER($B$7/50,W$80)))","v":1456},"EIN339000600",{"$f":"IF(Z85=\"\",\" - \",IF($B$6<0.7,Z85*POWER($B$8/50,Y$80),Z85*POWER($B$7/50,Y$80)))","v":2107}]
[750,15,"EIN116000750",744,"EIN216000750",1012,"EIN226000750",1374,"EIN336000750",1992,"EIN117500750",890,"EIN217500750",1196,"EIN227500750",1613,"EIN337500750",2339,"EIN119000750",1026,"EIN219000750",1372,"EIN229000750",1820,"EIN339000750",2634]
[900,18,"EIN116000900",893,"EIN216000900",1214,"EIN226000900",1649,"EIN336000900",2390,"EIN117500900",1068,"EIN217500900",1436,"EIN227500900",1935,"EIN337500900",2807,"EIN119000900",1231,"EIN219000900",1646,"EIN229000900",2184,"EIN339000900",3161]
[1050,21,"EIN116001050",1042,"EIN216001050",1416,"EIN226001050",1924,"EIN336001050",2789,"EIN117501050",1246,"EIN217501050",1675,"EIN227501050",2258,"EIN337501050",3275,"EIN119001050",1436,"EIN219001050",1920,"EIN229001050",2548,"EIN339001050",3688]
[1200,24,"EIN116001200",1190,"EIN216001200",1619,"EIN226001200",2198,"EIN336001200",3187,"EIN117501200",1424,"EIN217501200",1914,"EIN227501200",2580,"EIN337501200",3743,"EIN119001200",1642,"EIN219001200",2195,"EIN229001200",2912,"EIN339001200",4214]
[1350,27,"EIN116001350",1339,"EIN216001350",1821,"EIN226001350",2473,"EIN336001350",3586,"EIN117501350",1602,"EIN217501350",2153,"EIN227501350",2903,"EIN337501350",4211,"EIN119001350",1847,"EIN219001350",2469,"EIN229001350",3276,"EIN339001350",4741]
[1500,30,"EIN116001500",1488,"EIN216001500",2024,"EIN226001500",2748,"EIN336001500",3984,"EIN117501500",1781,"EIN217501500",2393,"EIN227501500",3225,"EIN337501500",4679,"EIN119001500",2052,"EIN219001500",2744,"EIN229001500",3641,"EIN339001500",5268]
[1650,33,"EIN116001650",1637,"EIN216001650",2226,"EIN226001650",3023,"EIN336001650",4382,"EIN117501650",1959,"EIN217501650",2632,"EIN227501650",3548,"EIN337501650",5146,"EIN119001650",2257,"EIN219001650",3018,"EIN229001650",4005,"EIN339001650",5795]
[1800,36,"EIN116001800",1786,"EIN216001800",2428,"EIN226001800",3298,"EIN336001800",4781,"EIN117501800",2137,"EIN217501800",2871,"EIN227501800",3870,"EIN337501800",5614,"EIN119001800",2462,"EIN219001800",3292,"EIN229001800",4369,"EIN339001800",6322]
[1950,39," - "," - ","EIN216001950",2631,"EIN226001950",3572,"EIN336001950",5179," - "," - ","EIN217501950",3110,"EIN227501950",4193,"EIN337501950",6082," - "," - ","EIN219001950",3567,"EIN229001950",4733,"EIN339001950",6848]
[2100,42," - "," - ","EIN216002100",2833,"EIN226002100",3847,"EIN336002100",5578," - "," - ","EIN217502100",3350,"EIN227502100",4515,"EIN337502100",6550," - "," - ","EIN219002100",3841,"EIN229002100",5097," - "," - "]
[2250,45," - "," - ","EIN216002250",3035,"EIN226002250",4122,"EIN336002250",5976," - "," - ","EIN217502250",3589,"EIN227502250",4838,"EIN337502250",7018," - "," - ","EIN219002250",4115,"EIN229002250",5461," - "," - "]
[2400,48," - "," - ","EIN216002400",3238,"EIN226002400",4397,"EIN336002400",6374," - "," - ","EIN217502400",3828,"EIN227502400",5160,"EIN337502400",7486," - "," - ","EIN219002400",4390,"EIN229002400",5825," - "," - "]
[2550,51," - "," - ","EIN216002550",3440,"EIN226002550",4672,"EIN336002550",6773," - "," - ","EIN217502550",4067,"EIN227502550",5483,"EIN337502550",7953," - "," - ","EIN219002550",4664,"EIN229002550",6189," - "," - "]
[2700,54," - "," - ","EIN216002700",3642,"EIN226002700",4946,"EIN336002700",7171," - "," - ","EIN217502700",4307,"EIN227502700",5805,"EIN337502700",8421," - "," - ","EIN219002700",4938,"EIN229002700",6553," - "," - "]
[3000,60," - "," - ","EIN216003000",4047,"EIN226003000",5496,"EIN336003000",7968," - "," - ","EIN217503000",4785,"EIN227503000",6450,"EIN337503000",9357," - "," - ","EIN219003000",5487,"EIN229003000",7281," - "," - "]
[]
[]
[]
["Tableau de référence"]
[]
["PENTE :",null,1.3498000000000001,null,1.3668,null,1.3845000000000001,null,1.3768,null,1.3451,null,1.3620000000000001,null,1.3756999999999999,null,1.3651,null,1.3404,null,1.3572,null,1.3669,null,1.3532999999999999]
["Hauteur",null,300,null,null,null,null,null,null,null,400,null,null,null,null,null,null,null,500]
["Type",null,"EIN11",null,"EIN21",null,"EIN22",null,"EIN33",null,"EIN11",null,"EIN21",null,"EIN22",null,"EIN33",null,"EIN11",null,"EIN21",null,"EIN22",null,"EIN33"]
["Longueur (mm)","Nombre éléments","Modèle","Watt \nDt 50°C","Modèle","Watt \nDt 50°C","Modèle","Watt \nDt 50°C","Modèle","Watt \nDt 50°C","Modèle","Watt \nDt 50°C","Modèle","Watt \nDt 50°C","Modèle","Watt \nDt 50°C","Modèle","Watt \nDt 50°C","Modèle","Watt \nDt 50°C","Modèle","Watt \nDt 50°C","Modèle","Watt \nDt 50°C","Modèle","Watt \nDt 50°C"]
[450,{"$f":"A62/50","v":9},{"$f":"IF(D62=\"\",\" - \",IF(LEN($A62)=3,C$60&$C$59&\"0\"&$A62,C$60&$C$59&$A62))","v":"EIN113000450"},248,{"$f":"IF(F62=\"\",\" - \",IF(LEN($A62)=3,E$60&$C$59&\"0\"&$A62,E$60&$C$59&$A62))","v":"EIN213000450"},361,{"$f":"IF(H62=\"\",\" - \",IF(LEN($A62)=3,G$60&$C$59&\"0\"&$A62,G$60&$C$59&$A62))","v":"EIN223000450"},474,{"$f":"IF(J62=\"\",\" - \",IF(LEN($A62)=3,I$60&$C$59&\"0\"&$A62,I$60&$C$59&$A62))","v":"EIN333000450"},672,{"$f":"IF(L62=\"\",\" - \",IF(LEN($A62)=3,K$60&$K$59&\"0\"&$A62,K$60&$K$59&$A62))","v":"EIN114000450"},318,{"$f":"IF(N62=\"\",\" - \",IF(LEN($A62)=3,M$60&$K$59&\"0\"&$A62,M$60&$K$59&$A62))","v":"EIN214000450"},448,{"$f":"IF(P62=\"\",\" - \",IF(LEN($A62)=3,O$60&$K$59&\"0\"&$A62,O$60&$K$59&$A62))","v":"EIN224000450"},601,{"$f":"IF(R62=\"\",\" - \",IF(LEN($A62)=3,Q$60&$K$59&\"0\"&$A62,Q$60&$K$59&$A62))","v":"EIN334000450"},863,{"$f":"IF(T62=\"\",\" - \",IF(LEN($A62)=3,S$60&$S$59&\"0\"&$A62,S$60&$S$59&$A62))","v":"EIN115000450"},384,{"$f":"IF(V62=\"\",\" - \",IF(LEN($A62)=3,U$60&$S$59&\"0\"&$A62,U$60&$S$59&$A62))","v":"EIN215000450"},530,{"$f":"IF(X62=\"\",\" - \",IF(LEN($A62)=3,W$60&$S$59&\"0\"&$A62,W$60&$S$59&$A62))","v":"EIN225000450"},718,{"$f":"IF(Z62=\"\",\" - \",IF(LEN($A62)=3,Y$60&$S$59&\"0\"&$A62,Y$60&$S$59&$A62))","v":"EIN335000450"},1037]
[600,{"$f":"A63/50","v":12},"EIN113000600",331,"EIN213000600",481,"EIN223000600",632,"EIN333000600",896,"EIN114000600",424,"EIN214000600",598,"EIN224000600",802,"EIN334000600",1151,{"$f":"IF(T63=\"\",\" - \",IF(LEN($A63)=3,S$60&$S$59&\"0\"&$A63,S$60&$S$59&$A63))","v":"EIN115000600"},512,"EIN215000600",706,"EIN225000600",957,"EIN335000600",1383]
[750,15,"EIN113000750",413,"EIN213000750",602,"EIN223000750",790,"EIN333000750",1121,"EIN114000750",530,"EIN214000750",747,"EIN224000750",1002,"EIN334000750",1439,"EIN115000750",640,"EIN215000750",883,"EIN225000750",1196,"EIN335000750",1729]
[900,18,"EIN113000900",496,"EIN213000900",722,"EIN223000900",948,"EIN333000900",1345,"EIN114000900",635,"EIN214000900",896,"EIN224000900",1202,"EIN334000900",1726,"EIN115000900",768,"EIN215000900",1059,"EIN225000900",1436,"EIN335000900",2075]
[1050,21,"EIN113001050",579,"EIN213001050",842,"EIN223001050",1106,"EIN333001050",1569,"EIN114001050",741,"EIN214001050",1046,"EIN224001050",1403,"EIN334001050",2014,"EIN115001050",896,"EIN215001050",1236,"EIN225001050",1675,"EIN335001050",2420]
[1200,24,"EIN113001200",661,"EIN213001200",962,"EIN223001200",1264,"EIN333001200",1793,"EIN114001200",847,"EIN214001200",1195,"EIN224001200",1603,"EIN334001200",2302,"EIN115001200",1024,"EIN215001200",1412,"EIN225001200",1914,"EIN335001200",2766]
[1350,27,"EIN113001350",744,"EIN213001350",1083,"EIN223001350",1422,"EIN333001350",2017,"EIN114001350",953,"EIN214001350",1345,"EIN224001350",1804,"EIN334001350",2589,"EIN115001350",1152,"EIN215001350",1589,"EIN225001350",2153,"EIN335001350",3112]
[1500,30,"EIN113001500",827,"EIN213001500",1203,"EIN223001500",1580,"EIN333001500",2241,"EIN114001500",1059,"EIN214001500",1494,"EIN224001500",2004,"EIN334001500",2877,"EIN115001500",1280,"EIN215001500",1766,"EIN225001500",2393,"EIN335001500",3458]
[1650,33,"EIN113001650",909,"EIN213001650",1323,"EIN223001650",1737,"EIN333001650",2465,"EIN114001650",1165,"EIN214001650",1643,"EIN224001650",2204,"EIN334001650",3165,"EIN115001650",1407,"EIN215001650",1942,"EIN225001650",2632,"EIN335001650",3803]
[1800,36,"EIN113001800",992,"EIN213001800",1444,"EIN223001800",1895,"EIN333001800",2689,"EIN114001800",1271,"EIN214001800",1793,"EIN224001800",2405,"EIN334001800",3452,"EIN115001800",1535,"EIN215001800",2119,"EIN225001800",2871,"EIN335001800",4149]
[1950,39," - ",null,"EIN213001950",1564,"EIN223001950",2053,"EIN333001950",2913," - ",null,"EIN214001950",1942,"EIN224001950",2605,"EIN334001950",3740," - ",null,"EIN215001950",2295,"EIN225001950",3110,"EIN335001950",4495]
[2100,42," - ",null,"EIN213002100",1684,"EIN223002100",2211,"EIN333002100",3137," - ",null,"EIN214002100",2092,"EIN224002100",2806,"EIN334002100",4028," - ",null,"EIN215002100",2472,"EIN225002100",3350,"EIN335002100",4841]
[2250,45," - ",null,"EIN213002250",1805,"EIN223002250",2369,"EIN333002250",3362," - ",null,"EIN214002250",2241,"EIN224002250",3006,"EIN334002250",4316," - ",null,"EIN215002250",2648,"EIN225002250",3589,"EIN335002250",5186]
[2400,48," - ",null,"EIN213002400",1925,"EIN223002400",2527,"EIN333002400",3586," - ",null,"EIN214002400",2390,"EIN224002400",3206,"EIN334002400",4603," - ",null,"EIN215002400",2825,"EIN225002400",3828,"EIN335002400",5532]
[2550,51," - ",null,"EIN213002550",2045,"EIN223002550",2685,"EIN333002550",3810," - ",null,"EIN214002550",2540,"EIN224002550",3407,"EIN334002550",4891," - ",null,"EIN215002550",3001,"EIN225002550",4067,"EIN335002550",5878]
[2700,54," - ",null,"EIN213002700",2165,"EIN223002700",2843,"EIN333002700",4034," - ",null,"EIN214002700",2689,"EIN224002700",3607,"EIN334002700",5179," - ",null,"EIN215002700",3178,"EIN225002700",4307,"EIN335002700",6224]
[3000,60," - ",null,"EIN213003000",2406,"EIN223003000",3159,"EIN333003000",4482," - ",null,"EIN214003000",2988,"EIN224003000",4008,"EIN334003000",5754," - ",null,"EIN215003000",3531,"EIN225003000",4785,"EIN335003000",6915]
[]
["PENTE :",null,1.3357000000000001,null,1.3523000000000001,null,1.3581000000000001,null,1.3414999999999999,null,1.3287,null,1.3451,null,1.3449,null,1.3238000000000001,null,1.3217000000000001,null,1.3379000000000001,null,1.3315999999999999,null,1.3061,null,null,null,null,null,null,null,null,null,null,null,null,null,null,null,null,null,null,1.3540000000000001]
["Hauteur",null,600,null,null,null,null,null,null,null,750,null,null,null,null,null,null,null,900]
["Type",null,"EIN11",null,"EIN21",null,"EIN22",null,"EIN33",null,"EIN11",null,"EIN21",null,"EIN22",null,"EIN33",null,"EIN11",null,"EIN21",null,"EIN22",null,"EIN33"]
["Longueur (mm)","Nombre éléments","Modèle","Watt \nDt 50°C","Modèle","Watt \nDt 50°C","Modèle","Watt \nDt 50°C","Modèle","Watt \nDt 50°C","Modèle","Watt \nDt 50°C","Modèle","Watt \nDt 50°C","Modèle","Watt \nDt 50°C","Modèle","Watt \nDt 50°C","Modèle","Watt \nDt 50°C","Modèle","Watt \nDt 50°C","Modèle","Watt \nDt 50°C","Modèle","Watt \nDt 50°C"]
[450,{"$f":"A84/50","v":9},{"$f":"IF(D84=\"\",\" - \",IF(LEN($A62)=3,C$82&$C$81&\"0\"&$A62,C$82&$C$81&$A62))","v":"EIN116000450"},446,{"$f":"IF(F84=\"\",\" - \",IF(LEN($A62)=3,E$82&$C$81&\"0\"&$A62,E$82&$C$81&$A62))","v":"EIN216000450"},607,{"$f":"IF(H84=\"\",\" - \",IF(LEN($A62)=3,G$82&$C$81&\"0\"&$A62,G$82&$C$81&$A62))","v":"EIN226000450"},824,{"$f":"IF(J84=\"\",\" - \",IF(LEN($A62)=3,I$82&$C$81&\"0\"&$A62,I$82&$C$81&$A62))","v":"EIN336000450"},1195,{"$f":"IF(L84=\"\",\" - \",IF(LEN($A84)=3,K$82&$K$81&\"0\"&$A84,K$82&$K$81&$A84))","v":"EIN117500450"},534,{"$f":"IF(N84=\"\",\" - \",IF(LEN($A84)=3,M$82&$K$81&\"0\"&$A84,M$82&$K$81&$A84))","v":"EIN217500450"},718,{"$f":"IF(P84=\"\",\" - \",IF(LEN($A84)=3,O$82&$K$81&\"0\"&$A84,O$82&$K$81&$A84))","v":"EIN227500450"},968,{"$f":"IF(R84=\"\",\" - \",IF(LEN($A84)=3,Q$82&$K$81&\"0\"&$A84,Q$82&$K$81&$A84))","v":"EIN337500450"},1404,{"$f":"IF(T84=\"\",\" - \",IF(LEN($A84)=3,S$82&$S$81&\"0\"&$A84,S$82&$S$81&$A84))","v":"EIN119000450"},616,{"$f":"IF(V84=\"\",\" - \",IF(LEN($A84)=3,U$82&$S$81&\"0\"&$A84,U$82&$S$81&$A84))","v":"EIN219000450"},823,{"$f":"IF(X84=\"\",\" - \",IF(LEN($A84)=3,W$82&$S$81&\"0\"&$A84,W$82&$S$81&$A84))","v":"EIN229000450"},1092,{"$f":"IF(Z84=\"\",\" - \",IF(LEN($A84)=3,Y$82&$S$81&\"0\"&$A84,Y$82&$S$81&$A84))","v":"EIN339000450"},1580]
[600,{"$f":"A85/50","v":12},"EIN116000600",595,"EIN216000600",809,"EIN226000600",1099,"EIN336000600",1594,"EIN117500600",712,"EIN217500600",957,"EIN227500600",1290,"EIN337500600",1871,"EIN119000600",821,"EIN219000600",1097,"EIN229000600",1456,"EIN339000600",2107]
[750,15,"EIN116000750",744,"EIN216000750",1012,"EIN226000750",1374,"EIN336000750",1992,"EIN117500750",890,"EIN217500750",1196,"EIN227500750",1613,"EIN337500750",2339,"EIN119000750",1026,"EIN219000750",1372,"EIN229000750",1820,"EIN339000750",2634]
[900,18,"EIN116000900",893,"EIN216000900",1214,"EIN226000900",1649,"EIN336000900",2390,"EIN117500900",1068,"EIN217500900",1436,"EIN227500900",1935,"EIN337500900",2807,"EIN119000900",1231,"EIN219000900",1646,"EIN229000900",2184,"EIN339000900",3161]
[1050,21,"EIN116001050",1042,"EIN216001050",1416,"EIN226001050",1924,"EIN336001050",2789,"EIN117501050",1246,"EIN217501050",1675,"EIN227501050",2258,"EIN337501050",3275,"EIN119001050",1436,"EIN219001050",1920,"EIN229001050",2548,"EIN339001050",3688]
[1200,24,"EIN116001200",1190,"EIN216001200",1619,"EIN226001200",2198,"EIN336001200",3187,"EIN117501200",1424,"EIN217501200",1914,"EIN227501200",2580,"EIN337501200",3743,"EIN119001200",1642,"EIN219001200",2195,"EIN229001200",2912,"EIN339001200",4214]
[1350,27,"EIN116001350",1339,"EIN216001350",1821,"EIN226001350",2473,"EIN336001350",3586,"EIN117501350",1602,"EIN217501350",2153,"EIN227501350",2903,"EIN337501350",4211,"EIN119001350",1847,"EIN219001350",2469,"EIN229001350",3276,"EIN339001350",4741]
[1500,30,"EIN116001500",1488,"EIN216001500",2024,"EIN226001500",2748,"EIN336001500",3984,"EIN117501500",1781,"EIN217501500",2393,"EIN227501500",3225,"EIN337501500",4679,"EIN119001500",2052,"EIN219001500",2744,"EIN229001500",3641,"EIN339001500",5268]
[1650,33,"EIN116001650",1637,"EIN216001650",2226,"EIN226001650",3023,"EIN336001650",4382,"EIN117501650",1959,"EIN217501650",2632,"EIN227501650",3548,"EIN337501650",5146,"EIN119001650",2257,"EIN219001650",3018,"EIN229001650",4005,"EIN339001650",5795]
[1800,36,"EIN116001800",1786,"EIN216001800",2428,"EIN226001800",3298,"EIN336001800",4781,"EIN117501800",2137,"EIN217501800",2871,"EIN227501800",3870,"EIN337501800",5614,"EIN119001800",2462,"EIN219001800",3292,"EIN229001800",4369,"EIN339001800",6322]
[1950,39," - ",null,"EIN216001950",2631,"EIN226001950",3572,"EIN336001950",5179," - ",null,"EIN217501950",3110,"EIN227501950",4193,"EIN337501950",6082," - ",null,"EIN219001950",3567,"EIN229001950",4733,"EIN339001950",6848]
[2100,42," - ",null,"EIN216002100",2833,"EIN226002100",3847,"EIN336002100",5578," - ",null,"EIN217502100",3350,"EIN227502100",4515,"EIN337502100",6550," - ",null,"EIN219002100",3841,"EIN229002100",5097," - "]
[2250,45," - ",null,"EIN216002250",3035,"EIN226002250",4122,"EIN336002250",5976," - ",null,"EIN217502250",3589,"EIN227502250",4838,"EIN337502250",7018," - ",null,"EIN219002250",4115,"EIN229002250",5461," - "]
[2400,48," - ",null,"EIN216002400",3238,"EIN226002400",4397,"EIN336002400",6374," - ",null,"EIN217502400",3828,"EIN227502400",5160,"EIN337502400",7486," - ",null,"EIN219002400",4390,"EIN229002400",5825," - "]
[2550,51," - ",null,"EIN216002550",3440,"EIN226002550",4672,"EIN336002550",6773," - ",null,"EIN217502550",4067,"EIN227502550",5483,"EIN337502550",7953," - ",null,"EIN219002550",4664,"EIN229002550",6189," - "]
[2700,54," - ",null,"EIN216002700",3642,"EIN226002700",4946,"EIN336002700",7171," - ",null,"EIN217502700",4307,"EIN227502700",5805,"EIN337502700",8421," - ",null,"EIN219002700",4938,"EIN229002700",6553," - "]
[3000,60," - ",null,"EIN216003000",4047,"EIN226003000",5496,"EIN336003000",7968," - ",null,"EIN217503000",4785,"EIN227503000",6450,"EIN337503000",9357," - ",null,"EIN219003000",5487,"EIN229003000",7281," - "]

{"sheet":"E-FLOW PARADA","index":4,"n_rows":100,"n_cols":44,"rows_kept":100,"cut":false,"hidden":false,"merged":[[81,0,81,1],[81,2,81,3],[81,4,81,5],[81,6,81,7],[81,8,81,9],[81,10,81,11],[79,18,79,19],[79,20,79,21],[79,22,79,23],[79,24,79,25],[81,24,81,25],[81,12,81,13],[81,14,81,15],[81,16,81,17],[81,18,81,19],[81,20,81,21],[81,22,81,23],[80,0,80,1],[80,2,80,9],[80,10,80,17],[80,18,80,25],[59,24,59,25],[79,0,79,1],[79,2,79,3],[79,4,79,5],[79,6,79,7],[79,8,79,9],[79,10,79,11],[79,12,79,13],[79,14,79,15],[79,16,79,17],[59,12,59,13],[59,14,59,15],[59,16,59,17],[59,18,59,19],[59,20,59,21],[59,22,59,23],[59,0,59,1],[59,2,59,3],[59,4,59,5],[59,6,59,7],[59,8,59,9],[59,10,59,11],[57,18,57,19],[57,20,57,21],[57,22,57,23],[57,24,57,25],[58,0,58,1],[58,2,58,9],[58,10,58,17],[58,18,58,25],[57,10,57,11],[57,12,57,13],[57,14,57,15],[57,16,57,17],[33,12,33,13],[33,14,33,15],[33,16,33,17],[57,0,57,1],[57,2,57,3],[57,4,57,5],[57,6,57,7],[57,8,57,9],[33,0,33,1],[33,2,33,3],[33,4,33,5],[33,6,33,7],[33,8,33,9],[33,10,33,11],[11,20,11,21],[11,22,11,23],[11,24,11,25],[33,24,33,25],[33,18,33,19],[33,20,33,21],[33,22,33,23],[32,0,32,1],[32,2,32,9],[32,10,32,17],[32,18,32,25],[10,18,10,25],[11,0,11,1],[11,2,11,3],[11,4,11,5],[11,6,11,7],[11,8,11,9],[11,10,11,11],[11,12,11,13],[11,14,11,15],[11,16,11,17],[10,10,10,17],[11,18,11,19],[10,0,10,1],[10,2,10,9],[2,2,2,6],[3,2,3,6],[4,2,4,6]]}
["Programme de calcul de la puissance thermique: E-FLOW PARADA"]
[]
["Te",75,"<= Entrez la température à l'entrée en C°"]
["Ts",65,"<= Entrez la température à la sortie en C°"]
["Ti",20,"<= Entrez la température ambiante en C°"]
["Rapport",{"$f":"(B4-B5)/(B3-B5)","v":0.81818181818181823}]
["Delta T",{"$f":"((B3+B4)/2)-B5","v":50}]
["Delta T2",{"$f":"(B3-B4)/LN((B3-B5)/(B4-B5))","v":49.83288654563971},"Si Rapport < 0,7"]
[]
[]
["Hauteur",null,{"$f":"C59","v":300},null,null,null,null,null,null,null,{"$f":"K59","v":400},null,null,null,null,null,null,null,{"$f":"S59","v":500}]
["Type",null,{"$f":"C60","v":"EPA11"},null,{"$f":"E60","v":"EPA21"},null,{"$f":"G60","v":"EPA22"},null,{"$f":"I60","v":"EPA33"},null,{"$f":"K60","v":"EPA11"},null,{"$f":"M60","v":"EPA21"},null,{"$f":"O60","v":"EPA22"},null,{"$f":"Q60","v":"EPA33"},null,{"$f":"S60","v":"EPA11"},null,{"$f":"U60","v":"EPA21"},null,{"$f":"W60","v":"EPA22"},null,{"$f":"Y60","v":"EPA33"}]
["Longueur (mm)","Nombre éléments","Modèle","Puissance (watts)     ","Modèle","Puissance (watts)     ","Modèle","Puissance (watts)     ","Modèle","Puissance (watts)     ","Modèle","Puissance (watts)     ","Modèle","Puissance (watts)     ","Modèle","Puissance (watts)     ","Modèle","Puissance (watts)     ","Modèle","Puissance (watts)     ","Modèle","Puissance (watts)     ","Modèle","Puissance (watts)     ","Modèle","Puissance (watts)     "]
[{"$f":"A62","v":450},{"$f":"B62","v":9},{"$f":"C62","v":"EPA113000450"},{"$f":"IF(D62=\"\",\" - \",IF($B$6<0.7,D62*POWER($B$8/50,C$58),D62*POWER($B$7/50,C$58)))","v":242},{"$f":"E62","v":"EPA213000450"},{"$f":"IF(F62=\"\",\" - \",IF($B$6<0.7,F62*POWER($B$8/50,E$58),F62*POWER($B$7/50,E$58)))","v":339},{"$f":"G62","v":"EPA223000450"},{"$f":"IF(H62=\"\",\" - \",IF($B$6<0.7,H62*POWER($B$8/50,G$58),H62*POWER($B$7/50,G$58)))","v":456},{"$f":"I62","v":"EPA333000450"},{"$f":"IF(J62=\"\",\" - \",IF($B$6<0.7,J62*POWER($B$8/50,I$58),J62*POWER($B$7/50,I$58)))","v":638},{"$f":"K62","v":"EPA114000450"},{"$f":"IF(L62=\"\",\" - \",IF($B$6<0.7,L62*POWER($B$8/50,K$58),L62*POWER($B$7/50,K$58)))","v":306},{"$f":"M62","v":"EPA214000450"},{"$f":"IF(N62=\"\",\" - \",IF($B$6<0.7,N62*POWER($B$8/50,M$58),N62*POWER($B$7/50,M$58)))","v":421},{"$f":"O62","v":"EPA224000450"},{"$f":"IF(P62=\"\",\" - \",IF($B$6<0.7,P62*POWER($B$8/50,O$58),P62*POWER($B$7/50,O$58)))","v":569},{"$f":"Q62","v":"EPA334000450"},{"$f":"IF(R62=\"\",\" - \",IF($B$6<0.7,R62*POWER($B$8/50,Q$58),R62*POWER($B$7/50,Q$58)))","v":809},{"$f":"S62","v":"EPA115000450"},{"$f":"IF(T62=\"\",\" - \",IF($B$6<0.7,T62*POWER($B$8/50,S$58),T62*POWER($B$7/50,S$58)))","v":366},{"$f":"U62","v":"EPA215000450"},{"$f":"IF(V62=\"\",\" - \",IF($B$6<0.7,V62*POWER($B$8/50,U$58),V62*POWER($B$7/50,U$58)))","v":498},{"$f":"W62","v":"EPA225000450"},{"$f":"IF(X62=\"\",\" - \",IF($B$6<0.7,X62*POWER($B$8/50,W$58),X62*POWER($B$7/50,W$58)))","v":675},{"$f":"Y62","v":"EPA335000450"},{"$f":"IF(Z62=\"\",\" - \",IF($B$6<0.7,Z62*POWER($B$8/50,Y$58),Z62*POWER($B$7/50,Y$58)))","v":970},null,null,null,null,null,null,null,null,null,null,null,null,null,","]
[{"$f":"A63","v":600},12,"EPA113000600",{"$f":"IF(D63=\"\",\" - \",IF($B$6<0.7,D63*POWER($B$8/50,C$58),D63*POWER($B$7/50,C$58)))","v":323},{"$f":"E63","v":"EPA213000600"},{"$f":"IF(F63=\"\",\" - \",IF($B$6<0.7,F63*POWER($B$8/50,E$58),F63*POWER($B$7/50,E$58)))","v":453},{"$f":"G63","v":"EPA223000600"},{"$f":"IF(H63=\"\",\" - \",IF($B$6<0.7,H63*POWER($B$8/50,G$58),H63*POWER($B$7/50,G$58)))","v":608},{"$f":"I63","v":"EPA333000600"},{"$f":"IF(J63=\"\",\" - \",IF($B$6<0.7,J63*POWER($B$8/50,I$58),J63*POWER($B$7/50,I$58)))","v":850},{"$f":"K63","v":"EPA114000600"},{"$f":"IF(L63=\"\",\" - \",IF($B$6<0.7,L63*POWER($B$8/50,K$58),L63*POWER($B$7/50,K$58)))","v":408},{"$f":"M63","v":"EPA214000600"},{"$f":"IF(N63=\"\",\" - \",IF($B$6<0.7,N63*POWER($B$8/50,M$58),N63*POWER($B$7/50,M$58)))","v":561},{"$f":"O63","v":"EPA224000600"},{"$f":"IF(P63=\"\",\" - \",IF($B$6<0.7,P63*POWER($B$8/50,O$58),P63*POWER($B$7/50,O$58)))","v":759},{"$f":"Q63","v":"EPA334000600"},{"$f":"IF(R63=\"\",\" - \",IF($B$6<0.7,R63*POWER($B$8/50,Q$58),R63*POWER($B$7/50,Q$58)))","v":1079},{"$f":"S63","v":"EPA115000600"},{"$f":"IF(T63=\"\",\" - \",IF($B$6<0.7,T63*POWER($B$8/50,S$58),T63*POWER($B$7/50,S$58)))","v":489},{"$f":"U63","v":"EPA215000600"},{"$f":"IF(V63=\"\",\" - \",IF($B$6<0.7,V63*POWER($B$8/50,U$58),V63*POWER($B$7/50,U$58)))","v":664},{"$f":"W63","v":"EPA225000600"},{"$f":"IF(X63=\"\",\" - \",IF($B$6<0.7,X63*POWER($B$8/50,W$58),X63*POWER($B$7/50,W$58)))","v":900},{"$f":"Y63","v":"EPA335000600"},{"$f":"IF(Z63=\"\",\" - \",IF($B$6<0.7,Z63*POWER($B$8/50,Y$58),Z63*POWER($B$7/50,Y$58)))","v":1293}]
[750,15,"EPA113000750",404,"EPA213000750",566,"EPA223000750",759,"EPA333000750",1063,"EPA114000750",510,"EPA214000750",702,"EPA224000750",949,"EPA334000750",1349,"EPA115000750",611,"EPA215000750",830,"EPA225000750",1124,"EPA335000750",1616]
[900,18,"EPA113000900",485,"EPA213000900",679,"EPA223000900",911,"EPA333000900",1275,"EPA114000900",612,"EPA214000900",842,"EPA224000900",1139,"EPA334000900",1619,"EPA115000900",733,"EPA215000900",996,"EPA225000900",1349,"EPA335000900",1939]
[1050,21,"EPA113001050",565,"EPA213001050",792,"EPA223001050",1063,"EPA333001050",1488,"EPA114001050",714,"EPA214001050",983,"EPA224001050",1328,"EPA334001050",1889,"EPA115001050",855,"EPA215001050",1162,"EPA225001050",1574,"EPA335001050",2262]
[1200,24,"EPA113001200",646,"EPA213001200",905,"EPA223001200",1215,"EPA333001200",1701,"EPA114001200",816,"EPA214001200",1123,"EPA224001200",1518,"EPA334001200",2158,"EPA115001200",977,"EPA215001200",1328,"EPA225001200",1799,"EPA335001200",2586]
[1350,27,"EPA113001350",727,"EPA213001350",1018,"EPA223001350",1367,"EPA333001350",1913,"EPA114001350",918,"EPA214001350",1263,"EPA224001350",1708,"EPA334001350",2428,"EPA115001350",1099,"EPA215001350",1494,"EPA225001350",2024,"EPA335001350",2909]
[1500,30,"EPA113001500",808,"EPA213001500",1132,"EPA223001500",1519,"EPA333001500",2126,"EPA114001500",1020,"EPA214001500",1404,"EPA224001500",1898,"EPA334001500",2698,"EPA115001500",1221,"EPA215001500",1660,"EPA225001500",2249,"EPA335001500",3232]
[1650,33,"EPA113001650",888,"EPA213001650",1245,"EPA223001650",1671,"EPA333001650",2338,"EPA114001650",1122,"EPA214001650",1544,"EPA224001650",2087,"EPA334001650",2968,"EPA115001650",1343,"EPA215001650",1826,"EPA225001650",2474,"EPA335001650",3555]
[1800,36," - "," - ","EPA213001800",1358,"EPA223001800",1823,"EPA333001800",2551," - "," - ","EPA214001800",1684,"EPA224001800",2277,"EPA334001800",3237," - "," - ","EPA215001800",1992,"EPA225001800",2699,"EPA335001800",3878]
[1950,39," - "," - ","EPA213001950",1471,"EPA223001950",1975,"EPA333001950",2764," - "," - ","EPA214001950",1825,"EPA224001950",2467,"EPA334001950",3507," - "," - ","EPA215001950",2158,"EPA225001950",2923,"EPA335001950",4201]
[2100,42," - "," - ","EPA213002100",1584,"EPA223002100",2126,"EPA333002100",2976," - "," - ","EPA214002100",1965,"EPA224002100",2657,"EPA334002100",3777," - "," - ","EPA215002100",2324,"EPA225002100",3148,"EPA335002100",4525]
[2250,45," - "," - ","EPA213002250",1697,"EPA223002250",2278,"EPA333002250",3189," - "," - ","EPA214002250",2106,"EPA224002250",2846,"EPA334002250",4047," - "," - ","EPA215002250",2490,"EPA225002250",3373,"EPA335002250",4848]
[2400,48," - "," - ","EPA213002400",1811,"EPA223002400",2430,"EPA333002400",3401," - "," - ","EPA214002400",2246,"EPA224002400",3036,"EPA334002400",4317," - "," - ","EPA215002400",2656,"EPA225002400",3598,"EPA335002400",5171]
[2550,51," - "," - ","EPA213002550",1924,"EPA223002550",2582,"EPA333002550",3614," - "," - ","EPA214002550",2386,"EPA224002550",3226,"EPA334002550",4586," - "," - ","EPA215002550",2822,"EPA225002550",3823,"EPA335002550",5494]
[2700,54," - "," - ","EPA213002700",2037,"EPA223002700",2734,"EPA333002700",3826," - "," - ","EPA214002700",2527,"EPA224002700",3416,"EPA334002700",4856," - "," - ","EPA215002700",2988,"EPA225002700",4048,"EPA335002700",5817]
[3000,60," - "," - ","EPA213003000",2263,"EPA223003000",3038,"EPA333003000",4252," - "," - ","EPA214003000",2807,"EPA224003000",3795,"EPA334003000",5396," - "," - ","EPA215003000",3320,"EPA225003000",4498,"EPA335003000",6464]
[]
[]
["Hauteur",null,{"$f":"C81","v":600},null,null,null,null,null,null,null,{"$f":"K81","v":750},null,null,null,null,null,null,null,{"$f":"S81","v":900}]
["Type",null,{"$f":"C82","v":"EPA11"},null,{"$f":"E82","v":"EPA21"},null,{"$f":"G82","v":"EPA22"},null,{"$f":"I82","v":"EPA33"},null,{"$f":"K82","v":"EPA11"},null,{"$f":"M82","v":"EPA21"},null,{"$f":"O82","v":"EPA22"},null,{"$f":"Q82","v":"EPA33"},null,{"$f":"S82","v":"EPA11"},null,{"$f":"U82","v":"EPA21"},null,{"$f":"W82","v":"EPA22"},null,{"$f":"Y82","v":"EPA33"}]
["Longueur (mm)","Nombre éléments","Modèle","Puissance (watts)     ","Modèle","Puissance (watts)     ","Modèle","Puissance (watts)     ","Modèle","Puissance (watts)     ","Modèle","Puissance (watts)     ","Modèle","Puissance (watts)     ","Modèle","Puissance (watts)     ","Modèle","Puissance (watts)     ","Modèle","Puissance (watts)     ","Modèle","Puissance (watts)     ","Modèle","Puissance (watts)     ","Modèle","Puissance (watts)     "]
[{"$f":"A84","v":450},{"$f":"B84","v":9},{"$f":"C84","v":"EPA116000450"},{"$f":"IF(D84=\"\",\" - \",IF($B$6<0.7,D84*POWER($B$8/50,C$80),D84*POWER($B$7/50,C$80)))","v":424},{"$f":"E84","v":"EPA216000450"},{"$f":"IF(F84=\"\",\" - \",IF($B$6<0.7,F84*POWER($B$8/50,E$80),F84*POWER($B$7/50,E$80)))","v":571},{"$f":"G84","v":"EPA226000450"},{"$f":"IF(H84=\"\",\" - \",IF($B$6<0.7,H84*POWER($B$8/50,G$80),H84*POWER($B$7/50,G$80)))","v":773},{"$f":"I84","v":"EPA336000450"},{"$f":"IF(J84=\"\",\" - \",IF($B$6<0.7,J84*POWER($B$8/50,I$80),J84*POWER($B$7/50,I$80)))","v":1120},{"$f":"K84","v":"EPA117500450"},{"$f":"IF(L84=\"\",\" - \",IF($B$6<0.7,L84*POWER($B$8/50,K$80),L84*POWER($B$7/50,K$80)))","v":506},{"$f":"M84","v":"EPA217500450"},{"$f":"IF(N84=\"\",\" - \",IF($B$6<0.7,N84*POWER($B$8/50,M$80),N84*POWER($B$7/50,M$80)))","v":676},{"$f":"O84","v":"EPA227500450"},{"$f":"IF(P84=\"\",\" - \",IF($B$6<0.7,P84*POWER($B$8/50,O$80),P84*POWER($B$7/50,O$80)))","v":911},{"$f":"Q84","v":"EPA337500450"},{"$f":"IF(R84=\"\",\" - \",IF($B$6<0.7,R84*POWER($B$8/50,Q$80),R84*POWER($B$7/50,Q$80)))","v":1329},{"$f":"S84","v":"EPA119000450"},{"$f":"IF(T84=\"\",\" - \",IF($B$6<0.7,T84*POWER($B$8/50,S$80),T84*POWER($B$7/50,S$80)))","v":584},{"$f":"U84","v":"EPA219000450"},{"$f":"IF(V84=\"\",\" - \",IF($B$6<0.7,V84*POWER($B$8/50,U$80),V84*POWER($B$7/50,U$80)))","v":776},{"$f":"W84","v":"EPA229000450"},{"$f":"IF(X84=\"\",\" - \",IF($B$6<0.7,X84*POWER($B$8/50,W$80),X84*POWER($B$7/50,W$80)))","v":1037},{"$f":"Y84","v":"EPA339000450"},{"$f":"IF(Z84=\"\",\" - \",IF($B$6<0.7,Z84*POWER($B$8/50,Y$80),Z84*POWER($B$7/50,Y$80)))","v":1521}]
[{"$f":"A85","v":600},12,{"$f":"C85","v":"EPA116000600"},{"$f":"IF(D85=\"\",\" - \",IF($B$6<0.7,D85*POWER($B$8/50,C$80),D85*POWER($B$7/50,C$80)))","v":565},"EPA216000600",{"$f":"IF(F85=\"\",\" - \",IF($B$6<0.7,F85*POWER($B$8/50,E$80),F85*POWER($B$7/50,E$80)))","v":762},"EPA226000600",{"$f":"IF(H85=\"\",\" - \",IF($B$6<0.7,H85*POWER($B$8/50,G$80),H85*POWER($B$7/50,G$80)))","v":1031},"EPA336000600",{"$f":"IF(J85=\"\",\" - \",IF($B$6<0.7,J85*POWER($B$8/50,I$80),J85*POWER($B$7/50,I$80)))","v":1493},"EPA117500600",{"$f":"IF(L85=\"\",\" - \",IF($B$6<0.7,L85*POWER($B$8/50,K$80),L85*POWER($B$7/50,K$80)))","v":675},"EPA217500600",{"$f":"IF(N85=\"\",\" - \",IF($B$6<0.7,N85*POWER($B$8/50,M$80),N85*POWER($B$7/50,M$80)))","v":901},"EPA227500600",{"$f":"IF(P85=\"\",\" - \",IF($B$6<0.7,P85*POWER($B$8/50,O$80),P85*POWER($B$7/50,O$80)))","v":1214},"EPA337500600",{"$f":"IF(R85=\"\",\" - \",IF($B$6<0.7,R85*POWER($B$8/50,Q$80),R85*POWER($B$7/50,Q$80)))","v":1772},"EPA119000600",{"$f":"IF(T85=\"\",\" - \",IF($B$6<0.7,T85*POWER($B$8/50,S$80),T85*POWER($B$7/50,S$80)))","v":779},"EPA219000600",{"$f":"IF(V85=\"\",\" - \",IF($B$6<0.7,V85*POWER($B$8/50,U$80),V85*POWER($B$7/50,U$80)))","v":1034},"EPA229000600",{"$f":"IF(X85=\"\",\" - \",IF($B$6<0.7,X85*POWER($B$8/50,W$80),X85*POWER($B$7/50,W$80)))","v":1383},"EPA339000600",{"$f":"IF(Z85=\"\",\" - \",IF($B$6<0.7,Z85*POWER($B$8/50,Y$80),Z85*POWER($B$7/50,Y$80)))","v":2028}]
[750,15,"EPA116000750",707,"EPA216000750",952,"EPA226000750",1289,"EPA336000750",1867,"EPA117500750",844,"EPA217500750",1127,"EPA227500750",1518,"EPA337500750",2215,"EPA119000750",974,"EPA219000750",1293,"EPA229000750",1729,"EPA339000750",2535]
[900,18,"EPA116000900",848,"EPA216000900",1142,"EPA226000900",1547,"EPA336000900",2240,"EPA117500900",1013,"EPA217500900",1352,"EPA227500900",1822,"EPA337500900",2658,"EPA119000900",1168,"EPA219000900",1552,"EPA229000900",2075,"EPA339000900",3041]
[1050,21,"EPA116001050",990,"EPA216001050",1333,"EPA226001050",1804,"EPA336001050",2613,"EPA117501050",1181,"EPA217501050",1577,"EPA227501050",2125,"EPA337501050",3101,"EPA119001050",1363,"EPA219001050",1810,"EPA229001050",2421,"EPA339001050",3548]
[1200,24,"EPA116001200",1131,"EPA216001200",1523,"EPA226001200",2062,"EPA336001200",2987,"EPA117501200",1350,"EPA217501200",1802,"EPA227501200",2429,"EPA337501200",3544,"EPA119001200",1558,"EPA219001200",2069,"EPA229001200",2766,"EPA339001200",4055]
[1350,27,"EPA116001350",1272,"EPA216001350",1713,"EPA226001350",2320,"EPA336001350",3360,"EPA117501350",1519,"EPA217501350",2028,"EPA227501350",2732,"EPA337501350",3987,"EPA119001350",1753,"EPA219001350",2327,"EPA229001350",3112,"EPA339001350",4562]
[1500,30,"EPA116001500",1414,"EPA216001500",1904,"EPA226001500",2578,"EPA336001500",3733,"EPA117501500",1688,"EPA217501500",2253,"EPA227501500",3036,"EPA337501500",4430,"EPA119001500",1947,"EPA219001500",2586,"EPA229001500",3458,"EPA339001500",5069]
[1650,33,"EPA116001650",1555,"EPA216001650",2094,"EPA226001650",2835,"EPA336001650",4107,"EPA117501650",1856,"EPA217501650",2478,"EPA227501650",3340,"EPA337501650",4873,"EPA119001650",2142,"EPA219001650",2845,"EPA229001650",3804,"EPA339001650",5576]
[1800,36," - "," - ","EPA216001800",2285,"EPA226001800",3093,"EPA336001800",4480," - "," - ","EPA217501800",2704,"EPA227501800",3643,"EPA337501800",5316," - "," - ","EPA219001800",3103,"EPA229001800",4150,"EPA339001800",6083]
[1950,39," - "," - ","EPA216001950",2475,"EPA226001950",3351,"EPA336001950",4853," - "," - ","EPA217501950",2929,"EPA227501950",3947,"EPA337501950",5759," - "," - ","EPA219001950",3362,"EPA229001950",4496,"EPA339001950",6590]
[2100,42," - "," - ","EPA216002100",2665,"EPA226002100",3609,"EPA336002100",5226," - "," - ","EPA217502100",3154,"EPA227502100",4250,"EPA337502100",6202," - "," - ","EPA219002100",3620,"EPA229002100",4841,"EPA339002100",7097]
[2250,45," - "," - ","EPA216002250",2856,"EPA226002250",3866,"EPA336002250",5600," - "," - ","EPA217502250",3380,"EPA227502250",4554,"EPA337502250",6645," - "," - ","EPA219002250",3879,"EPA229002250",5187,"EPA339002250",7604]
[2400,48," - "," - ","EPA216002400",3046,"EPA226002400",4124,"EPA336002400",5973," - "," - ","EPA217502400",3605,"EPA227502400",4858,"EPA337502400",7088," - "," - ","EPA219002400",4138,"EPA229002400",5533,"EPA339002400",8111]
[2550,51," - "," - ","EPA216002550",3236,"EPA226002550",4382,"EPA336002550",6346," - "," - ","EPA217502550",3830,"EPA227502550",5161,"EPA337502550",7531," - "," - ","EPA219002550",4396,"EPA229002550",5879,"EPA339002550",8617]
[2700,54," - "," - ","EPA216002700",3427,"EPA226002700",4640,"EPA336002700",6720," - "," - ","EPA217502700",4055,"EPA227502700",5465,"EPA337502700",7974," - "," - ","EPA219002700",4655,"EPA229002700",6225,"EPA339002700",9124]
[3000,60," - "," - ","EPA216003000",3808,"EPA226003000",5155,"EPA336003000",7466," - "," - ","EPA217503000",4506,"EPA227503000",6072,"EPA337503000",8860," - "," - ","EPA219003000",5172,"EPA229003000",6916,"EPA339003000",10138]
[]
[]
[]
["Tableau de référence"]
[]
["PENTE :",null,1.3435999999999999,null,1.3096000000000001,null,1.3153999999999999,null,1.3144,null,1.3382000000000001,null,1.3209,null,1.3208,null,1.3224,null,1.3329,null,1.3322000000000001,null,1.3261000000000001,null,1.3323]
["Hauteur",null,300,null,null,null,null,null,null,null,400,null,null,null,null,null,null,null,500]
["Type",null,"EPA11",null,"EPA21",null,"EPA22",null,"EPA33",null,"EPA11",null,"EPA21",null,"EPA22",null,"EPA33",null,"EPA11",null,"EPA21",null,"EPA22",null,"EPA33"]
["Longueur (mm)","Nombre éléments","Modèle","Watt \nDt 50°C","Modèle","Watt \nDt 50°C","Modèle","Watt \nDt 50°C","Modèle","Watt \nDt 50°C","Modèle","Watt \nDt 50°C","Modèle","Watt \nDt 50°C","Modèle","Watt \nDt 50°C","Modèle","Watt \nDt 50°C","Modèle","Watt \nDt 50°C","Modèle","Watt \nDt 50°C","Modèle","Watt \nDt 50°C","Modèle","Watt \nDt 50°C"]
[450,{"$f":"A62/50","v":9},{"$f":"IF(D62=\"\",\" - \",IF(LEN($A62)=3,C$60&$C$59&\"0\"&$A62,C$60&$C$59&$A62))","v":"EPA113000450"},242,{"$f":"IF(F62=\"\",\" - \",IF(LEN($A62)=3,E$60&$C$59&\"0\"&$A62,E$60&$C$59&$A62))","v":"EPA213000450"},339,{"$f":"IF(H62=\"\",\" - \",IF(LEN($A62)=3,G$60&$C$59&\"0\"&$A62,G$60&$C$59&$A62))","v":"EPA223000450"},456,{"$f":"IF(J62=\"\",\" - \",IF(LEN($A62)=3,I$60&$C$59&\"0\"&$A62,I$60&$C$59&$A62))","v":"EPA333000450"},638,{"$f":"IF(L62=\"\",\" - \",IF(LEN($A62)=3,K$60&$K$59&\"0\"&$A62,K$60&$K$59&$A62))","v":"EPA114000450"},306,{"$f":"IF(N62=\"\",\" - \",IF(LEN($A62)=3,M$60&$K$59&\"0\"&$A62,M$60&$K$59&$A62))","v":"EPA214000450"},421,{"$f":"IF(P62=\"\",\" - \",IF(LEN($A62)=3,O$60&$K$59&\"0\"&$A62,O$60&$K$59&$A62))","v":"EPA224000450"},569,{"$f":"IF(R62=\"\",\" - \",IF(LEN($A62)=3,Q$60&$K$59&\"0\"&$A62,Q$60&$K$59&$A62))","v":"EPA334000450"},809,{"$f":"IF(T62=\"\",\" - \",IF(LEN($A62)=3,S$60&$S$59&\"0\"&$A62,S$60&$S$59&$A62))","v":"EPA115000450"},366,{"$f":"IF(V62=\"\",\" - \",IF(LEN($A62)=3,U$60&$S$59&\"0\"&$A62,U$60&$S$59&$A62))","v":"EPA215000450"},498,{"$f":"IF(X62=\"\",\" - \",IF(LEN($A62)=3,W$60&$S$59&\"0\"&$A62,W$60&$S$59&$A62))","v":"EPA225000450"},675,{"$f":"IF(Z62=\"\",\" - \",IF(LEN($A62)=3,Y$60&$S$59&\"0\"&$A62,Y$60&$S$59&$A62))","v":"EPA335000450"},970]
[600,{"$f":"A63/50","v":12},"EPA113000600",323,"EPA213000600",453,"EPA223000600",608,"EPA333000600",850,"EPA114000600",408,"EPA214000600",561,"EPA224000600",759,"EPA334000600",1079,{"$f":"IF(T63=\"\",\" - \",IF(LEN($A63)=3,S$60&$S$59&\"0\"&$A63,S$60&$S$59&$A63))","v":"EPA115000600"},489,"EPA215000600",664,"EPA225000600",900,"EPA335000600",1293]
[750,15,"EPA113000750",404,"EPA213000750",566,"EPA223000750",759,"EPA333000750",1063,"EPA114000750",510,"EPA214000750",702,"EPA224000750",949,"EPA334000750",1349,"EPA115000750",611,"EPA215000750",830,"EPA225000750",1124,"EPA335000750",1616]
[900,18,"EPA113000900",485,"EPA213000900",679,"EPA223000900",911,"EPA333000900",1275,"EPA114000900",612,"EPA214000900",842,"EPA224000900",1139,"EPA334000900",1619,"EPA115000900",733,"EPA215000900",996,"EPA225000900",1349,"EPA335000900",1939]
[1050,21,"EPA113001050",565,"EPA213001050",792,"EPA223001050",1063,"EPA333001050",1488,"EPA114001050",714,"EPA214001050",983,"EPA224001050",1328,"EPA334001050",1889,"EPA115001050",855,"EPA215001050",1162,"EPA225001050",1574,"EPA335001050",2262]
[1200,24,"EPA113001200",646,"EPA213001200",905,"EPA223001200",1215,"EPA333001200",1701,"EPA114001200",816,"EPA214001200",1123,"EPA224001200",1518,"EPA334001200",2158,"EPA115001200",977,"EPA215001200",1328,"EPA225001200",1799,"EPA335001200",2586]
[1350,27,"EPA113001350",727,"EPA213001350",1018,"EPA223001350",1367,"EPA333001350",1913,"EPA114001350",918,"EPA214001350",1263,"EPA224001350",1708,"EPA334001350",2428,"EPA115001350",1099,"EPA215001350",1494,"EPA225001350",2024,"EPA335001350",2909]
[1500,30,"EPA113001500",808,"EPA213001500",1132,"EPA223001500",1519,"EPA333001500",2126,"EPA114001500",1020,"EPA214001500",1404,"EPA224001500",1898,"EPA334001500",2698,"EPA115001500",1221,"EPA215001500",1660,"EPA225001500",2249,"EPA335001500",3232]
[1650,33,"EPA113001650",888,"EPA213001650",1245,"EPA223001650",1671,"EPA333001650",2338,"EPA114001650",1122,"EPA214001650",1544,"EPA224001650",2087,"EPA334001650",2968,"EPA115001650",1343,"EPA215001650",1826,"EPA225001650",2474,"EPA335001650",3555]
[1800,36," - ",null,"EPA213001800",1358,"EPA223001800",1823,"EPA333001800",2551," - ",null,"EPA214001800",1684,"EPA224001800",2277,"EPA334001800",3237," - ",null,"EPA215001800",1992,"EPA225001800",2699,"EPA335001800",3878]
[1950,39," - ",null,"EPA213001950",1471,"EPA223001950",1975,"EPA333001950",2764," - ",null,"EPA214001950",1825,"EPA224001950",2467,"EPA334001950",3507," - ",null,"EPA215001950",2158,"EPA225001950",2923,"EPA335001950",4201]
[2100,42," - ",null,"EPA213002100",1584,"EPA223002100",2126,"EPA333002100",2976," - ",null,"EPA214002100",1965,"EPA224002100",2657,"EPA334002100",3777," - ",null,"EPA215002100",2324,"EPA225002100",3148,"EPA335002100",4525]
[2250,45," - ",null,"EPA213002250",1697,"EPA223002250",2278,"EPA333002250",3189," - ",null,"EPA214002250",2106,"EPA224002250",2846,"EPA334002250",4047," - ",null,"EPA215002250",2490,"EPA225002250",3373,"EPA335002250",4848]
[2400,48," - ",null,"EPA213002400",1811,"EPA223002400",2430,"EPA333002400",3401," - ",null,"EPA214002400",2246,"EPA224002400",3036,"EPA334002400",4317," - ",null,"EPA215002400",2656,"EPA225002400",3598,"EPA335002400",5171]
[2550,51," - ",null,"EPA213002550",1924,"EPA223002550",2582,"EPA333002550",3614," - ",null,"EPA214002550",2386,"EPA224002550",3226,"EPA334002550",4586," - ",null,"EPA215002550",2822,"EPA225002550",3823,"EPA335002550",5494]
[2700,54," - ",null,"EPA213002700",2037,"EPA223002700",2734,"EPA333002700",3826," - ",null,"EPA214002700",2527,"EPA224002700",3416,"EPA334002700",4856," - ",null,"EPA215002700",2988,"EPA225002700",4048,"EPA335002700",5817]
[3000,60," - ",null,"EPA213003000",2263,"EPA223003000",3038,"EPA333003000",4252," - ",null,"EPA214003000",2807,"EPA224003000",3795,"EPA334003000",5396," - ",null,"EPA215003000",3320,"EPA225003000",4498,"EPA335003000",6464]
[]
["PENTE :",null,1.3274999999999999,null,1.3434999999999999,null,1.3314999999999999,null,1.3412999999999999,null,1.3224,null,1.3584000000000001,null,1.3496999999999999,null,1.3595999999999999,null,1.3171999999999999,null,1.3732,null,1.3677999999999999,null,1.3778999999999999,null,null,null,null,null,null,null,null,null,null,null,null,null,null,null,null,null,null,1.3540000000000001]
["Hauteur",null,600,null,null,null,null,null,null,null,750,null,null,null,null,null,null,null,900]
["Type",null,"EPA11",null,"EPA21",null,"EPA22",null,"EPA33",null,"EPA11",null,"EPA21",null,"EPA22",null,"EPA33",null,"EPA11",null,"EPA21",null,"EPA22",null,"EPA33"]
["Longueur (mm)","Nombre éléments","Modèle","Watt \nDt 50°C","Modèle","Watt \nDt 50°C","Modèle","Watt \nDt 50°C","Modèle","Watt \nDt 50°C","Modèle","Watt \nDt 50°C","Modèle","Watt \nDt 50°C","Modèle","Watt \nDt 50°C","Modèle","Watt \nDt 50°C","Modèle",null,"Modèle","Watt \nDt 50°C","Modèle","Watt \nDt 50°C","Modèle","Watt \nDt 50°C"]
[450,{"$f":"A84/50","v":9},{"$f":"IF(D84=\"\",\" - \",IF(LEN($A62)=3,C$82&$C$81&\"0\"&$A62,C$82&$C$81&$A62))","v":"EPA116000450"},424,{"$f":"IF(F84=\"\",\" - \",IF(LEN($A62)=3,E$82&$C$81&\"0\"&$A62,E$82&$C$81&$A62))","v":"EPA216000450"},571,{"$f":"IF(H84=\"\",\" - \",IF(LEN($A62)=3,G$82&$C$81&\"0\"&$A62,G$82&$C$81&$A62))","v":"EPA226000450"},773,{"$f":"IF(J84=\"\",\" - \",IF(LEN($A62)=3,I$82&$C$81&\"0\"&$A62,I$82&$C$81&$A62))","v":"EPA336000450"},1120,{"$f":"IF(L84=\"\",\" - \",IF(LEN($A84)=3,K$82&$K$81&\"0\"&$A84,K$82&$K$81&$A84))","v":"EPA117500450"},506,{"$f":"IF(N84=\"\",\" - \",IF(LEN($A84)=3,M$82&$K$81&\"0\"&$A84,M$82&$K$81&$A84))","v":"EPA217500450"},676,{"$f":"IF(P84=\"\",\" - \",IF(LEN($A84)=3,O$82&$K$81&\"0\"&$A84,O$82&$K$81&$A84))","v":"EPA227500450"},911,{"$f":"IF(R84=\"\",\" - \",IF(LEN($A84)=3,Q$82&$K$81&\"0\"&$A84,Q$82&$K$81&$A84))","v":"EPA337500450"},1329,{"$f":"IF(T84=\"\",\" - \",IF(LEN($A84)=3,S$82&$S$81&\"0\"&$A84,S$82&$S$81&$A84))","v":"EPA119000450"},584,{"$f":"IF(V84=\"\",\" - \",IF(LEN($A84)=3,U$82&$S$81&\"0\"&$A84,U$82&$S$81&$A84))","v":"EPA219000450"},776,{"$f":"IF(X84=\"\",\" - \",IF(LEN($A84)=3,W$82&$S$81&\"0\"&$A84,W$82&$S$81&$A84))","v":"EPA229000450"},1037,{"$f":"IF(Z84=\"\",\" - \",IF(LEN($A84)=3,Y$82&$S$81&\"0\"&$A84,Y$82&$S$81&$A84))","v":"EPA339000450"},1521]
[600,{"$f":"A85/50","v":12},"EPA116000600",565,"EPA216000600",762,"EPA226000600",1031,"EPA336000600",1493,"EPA117500600",675,"EPA217500600",901,"EPA227500600",1214,"EPA337500600",1772,"EPA119000600",779,"EPA219000600",1034,"EPA229000600",1383,"EPA339000600",2028]
[750,15,"EPA116000750",707,"EPA216000750",952,"EPA226000750",1289,"EPA336000750",1867,"EPA117500750",844,"EPA217500750",1127,"EPA227500750",1518,"EPA337500750",2215,"EPA119000750",974,"EPA219000750",1293,"EPA229000750",1729,"EPA339000750",2535]
[900,18,"EPA116000900",848,"EPA216000900",1142,"EPA226000900",1547,"EPA336000900",2240,"EPA117500900",1013,"EPA217500900",1352,"EPA227500900",1822,"EPA337500900",2658,"EPA119000900",1168,"EPA219000900",1552,"EPA229000900",2075,"EPA339000900",3041]
[1050,21,"EPA116001050",990,"EPA216001050",1333,"EPA226001050",1804,"EPA336001050",2613,"EPA117501050",1181,"EPA217501050",1577,"EPA227501050",2125,"EPA337501050",3101,"EPA119001050",1363,"EPA219001050",1810,"EPA229001050",2421,"EPA339001050",3548]
[1200,24,"EPA116001200",1131,"EPA216001200",1523,"EPA226001200",2062,"EPA336001200",2987,"EPA117501200",1350,"EPA217501200",1802,"EPA227501200",2429,"EPA337501200",3544,"EPA119001200",1558,"EPA219001200",2069,"EPA229001200",2766,"EPA339001200",4055]
[1350,27,"EPA116001350",1272,"EPA216001350",1713,"EPA226001350",2320,"EPA336001350",3360,"EPA117501350",1519,"EPA217501350",2028,"EPA227501350",2732,"EPA337501350",3987,"EPA119001350",1753,"EPA219001350",2327,"EPA229001350",3112,"EPA339001350",4562]
[1500,30,"EPA116001500",1414,"EPA216001500",1904,"EPA226001500",2578,"EPA336001500",3733,"EPA117501500",1688,"EPA217501500",2253,"EPA227501500",3036,"EPA337501500",4430,"EPA119001500",1947,"EPA219001500",2586,"EPA229001500",3458,"EPA339001500",5069]
[1650,33,"EPA116001650",1555,"EPA216001650",2094,"EPA226001650",2835,"EPA336001650",4107,"EPA117501650",1856,"EPA217501650",2478,"EPA227501650",3340,"EPA337501650",4873,"EPA119001650",2142,"EPA219001650",2845,"EPA229001650",3804,"EPA339001650",5576]
[1800,36," - ",null,"EPA216001800",2285,"EPA226001800",3093,"EPA336001800",4480," - ",null,"EPA217501800",2704,"EPA227501800",3643,"EPA337501800",5316," - ",null,"EPA219001800",3103,"EPA229001800",4150,"EPA339001800",6083]
[1950,39," - ",null,"EPA216001950",2475,"EPA226001950",3351,"EPA336001950",4853," - ",null,"EPA217501950",2929,"EPA227501950",3947,"EPA337501950",5759," - ",null,"EPA219001950",3362,"EPA229001950",4496,"EPA339001950",6590]
[2100,42," - ",null,"EPA216002100",2665,"EPA226002100",3609,"EPA336002100",5226," - ",null,"EPA217502100",3154,"EPA227502100",4250,"EPA337502100",6202," - ",null,"EPA219002100",3620,"EPA229002100",4841,"EPA339002100",7097]
[2250,45," - ",null,"EPA216002250",2856,"EPA226002250",3866,"EPA336002250",5600," - ",null,"EPA217502250",3380,"EPA227502250",4554,"EPA337502250",6645," - ",null,"EPA219002250",3879,"EPA229002250",5187,"EPA339002250",7604]
[2400,48," - ",null,"EPA216002400",3046,"EPA226002400",4124,"EPA336002400",5973," - ",null,"EPA217502400",3605,"EPA227502400",4858,"EPA337502400",7088," - ",null,"EPA219002400",4138,"EPA229002400",5533,"EPA339002400",8111]
[2550,51," - ",null,"EPA216002550",3236,"EPA226002550",4382,"EPA336002550",6346," - ",null,"EPA217502550",3830,"EPA227502550",5161,"EPA337502550",7531," - ",null,"EPA219002550",4396,"EPA229002550",5879,"EPA339002550",8617]
[2700,54," - ",null,"EPA216002700",3427,"EPA226002700",4640,"EPA336002700",6720," - ",null,"EPA217502700",4055,"EPA227502700",5465,"EPA337502700",7974," - ",null,"EPA219002700",4655,"EPA229002700",6225,"EPA339002700",9124]
[3000,60," - ",null,"EPA216003000",3808,"EPA226003000",5155,"EPA336003000",7466," - ",null,"EPA217503000",4506,"EPA227503000",6072,"EPA337503000",8860," - ",null,"EPA219003000",5172,"EPA229003000",6916,"EPA339003000",10138]

{"sheet":"E-FLOW RAMO","index":5,"n_rows":99,"n_cols":44,"rows_kept":99,"cut":false,"hidden":false,"merged":[[10,0,10,1],[10,2,10,9],[2,2,2,6],[3,2,3,6],[4,2,4,6],[32,0,32,1],[32,2,32,9],[32,10,32,17],[32,18,32,25],[10,18,10,25],[11,0,11,1],[11,2,11,3],[11,4,11,5],[11,6,11,7],[11,8,11,9],[11,10,11,11],[11,12,11,13],[11,14,11,15],[11,16,11,17],[10,10,10,17],[11,18,11,19],[11,20,11,21],[11,22,11,23],[11,24,11,25],[33,24,33,25],[33,18,33,19],[33,20,33,21],[33,22,33,23],[33,12,33,13],[33,14,33,15],[33,16,33,17],[56,0,56,1],[56,2,56,3],[56,4,56,5],[56,6,56,7],[56,8,56,9],[33,0,33,1],[33,2,33,3],[33,4,33,5],[33,6,33,7],[33,8,33,9],[33,10,33,11],[56,18,56,19],[56,20,56,21],[56,22,56,23],[56,24,56,25],[57,0,57,1],[57,2,57,9],[57,10,57,17],[57,18,57,25],[56,10,56,11],[56,12,56,13],[56,14,56,15],[56,16,56,17],[58,16,58,17],[58,18,58,19],[58,20,58,21],[58,22,58,23],[58,0,58,1],[58,2,58,3],[58,4,58,5],[58,6,58,7],[58,8,58,9],[58,10,58,11],[79,0,79,1],[79,2,79,9],[79,10,79,17],[79,18,79,25],[58,24,58,25],[78,0,78,1],[78,2,78,3],[78,4,78,5],[78,6,78,7],[78,8,78,9],[78,10,78,11],[78,12,78,13],[78,14,78,15],[78,16,78,17],[58,12,58,13],[58,14,58,15],[80,10,80,11],[78,18,78,19],[78,20,78,21],[78,22,78,23],[78,24,78,25],[80,24,80,25],[80,12,80,13],[80,14,80,15],[80,16,80,17],[80,18,80,19],[80,20,80,21],[80,22,80,23],[80,0,80,1],[80,2,80,3],[80,4,80,5],[80,6,80,7],[80,8,80,9]]}
["Programme de calcul de la puissance thermique: E-FLOW RAMO"]
[]
["Te",75,"<= Entrez la température à l'entrée en C°"]
["Ts",65,"<= Entrez la température à la sortie en C°"]
["Ti",20,"<= Entrez la température ambiante en C°"]
["Rapport",{"$f":"(B4-B5)/(B3-B5)","v":0.81818181818181823}]
["Delta T",{"$f":"((B3+B4)/2)-B5","v":50}]
["Delta T2",{"$f":"(B3-B4)/LN((B3-B5)/(B4-B5))","v":49.83288654563971},"Si Rapport < 0,7"]
[]
[]
["Hauteur",null,{"$f":"C58","v":300},null,null,null,null,null,null,null,{"$f":"K58","v":400},null,null,null,null,null,null,null,{"$f":"S58","v":500}]
["Type",null,{"$f":"C59","v":"ERA11"},null,{"$f":"E59","v":"ERA21"},null,{"$f":"G59","v":"ERA22"},null,{"$f":"I59","v":"ERA33"},null,{"$f":"K59","v":"ERA11"},null,{"$f":"M59","v":"ERA21"},null,{"$f":"O59","v":"ERA22"},null,{"$f":"Q59","v":"ERA33"},null,{"$f":"S59","v":"ERA11"},null,{"$f":"U59","v":"ERA21"},null,{"$f":"W59","v":"ERA22"},null,{"$f":"Y59","v":"ERA33"}]
["Longueur (mm)","Nombre éléments","Modèle","Puissance (watts)     ","Modèle","Puissance (watts)     ","Modèle","Puissance (watts)     ","Modèle","Puissance (watts)     ","Modèle","Puissance (watts)     ","Modèle","Puissance (watts)     ","Modèle","Puissance (watts)     ","Modèle","Puissance (watts)     ","Modèle","Puissance (watts)     ","Modèle","Puissance (watts)     ","Modèle","Puissance (watts)     ","Modèle","Puissance (watts)     "]
[{"$f":"A61","v":450},{"$f":"B61","v":9},{"$f":"C61","v":"ERA113000450"},{"$f":"IF(D61=\"\",\" - \",IF($B$6<0.7,D61*POWER($B$8/50,C$57),D61*POWER($B$7/50,C$57)))","v":242},{"$f":"E61","v":"ERA213000450"},{"$f":"IF(F61=\"\",\" - \",IF($B$6<0.7,F61*POWER($B$8/50,E$57),F61*POWER($B$7/50,E$57)))","v":339},{"$f":"G61","v":"ERA223000450"},{"$f":"IF(H61=\"\",\" - \",IF($B$6<0.7,H61*POWER($B$8/50,G$57),H61*POWER($B$7/50,G$57)))","v":456},{"$f":"I61","v":"ERA333000450"},{"$f":"IF(J61=\"\",\" - \",IF($B$6<0.7,J61*POWER($B$8/50,I$57),J61*POWER($B$7/50,I$57)))","v":638},{"$f":"K61","v":"ERA114000450"},{"$f":"IF(L61=\"\",\" - \",IF($B$6<0.7,L61*POWER($B$8/50,K$57),L61*POWER($B$7/50,K$57)))","v":306},{"$f":"M61","v":"ERA214000450"},{"$f":"IF(N61=\"\",\" - \",IF($B$6<0.7,N61*POWER($B$8/50,M$57),N61*POWER($B$7/50,M$57)))","v":421},{"$f":"O61","v":"ERA224000450"},{"$f":"IF(P61=\"\",\" - \",IF($B$6<0.7,P61*POWER($B$8/50,O$57),P61*POWER($B$7/50,O$57)))","v":569},{"$f":"Q61","v":"ERA334000450"},{"$f":"IF(R61=\"\",\" - \",IF($B$6<0.7,R61*POWER($B$8/50,Q$57),R61*POWER($B$7/50,Q$57)))","v":809},{"$f":"S61","v":"ERA115000450"},{"$f":"IF(T61=\"\",\" - \",IF($B$6<0.7,T61*POWER($B$8/50,S$57),T61*POWER($B$7/50,S$57)))","v":366},{"$f":"U61","v":"ERA215000450"},{"$f":"IF(V61=\"\",\" - \",IF($B$6<0.7,V61*POWER($B$8/50,U$57),V61*POWER($B$7/50,U$57)))","v":498},{"$f":"W61","v":"ERA225000450"},{"$f":"IF(X61=\"\",\" - \",IF($B$6<0.7,X61*POWER($B$8/50,W$57),X61*POWER($B$7/50,W$57)))","v":675},{"$f":"Y61","v":"ERA335000450"},{"$f":"IF(Z61=\"\",\" - \",IF($B$6<0.7,Z61*POWER($B$8/50,Y$57),Z61*POWER($B$7/50,Y$57)))","v":970},null,null,null,null,null,null,null,null,null,null,null,null,null,","]
[{"$f":"A62","v":600},12,"ERA113000600",323,{"$f":"E62","v":"ERA213000600"},453,{"$f":"G62","v":"ERA223000600"},608,{"$f":"I62","v":"ERA333000600"},850,{"$f":"K62","v":"ERA114000600"},408,{"$f":"M62","v":"ERA214000600"},561,{"$f":"O62","v":"ERA224000600"},759,{"$f":"Q62","v":"ERA334000600"},1079,{"$f":"S62","v":"ERA115000600"},489,{"$f":"U62","v":"ERA215000600"},664,{"$f":"W62","v":"ERA225000600"},900,{"$f":"Y62","v":"ERA335000600"},1293]
[750,15,"ERA113000750",404,"ERA213000750",566,"ERA223000750",759,"ERA333000750",1063,"ERA114000750",510,"ERA214000750",702,"ERA224000750",949,"ERA334000750",1349,"ERA115000750",611,"ERA215000750",830,"ERA225000750",1124,"ERA335000750",1616]
[900,18,"ERA113000900",485,"ERA213000900",679,"ERA223000900",911,"ERA333000900",1275,"ERA114000900",612,"ERA214000900",842,"ERA224000900",1139,"ERA334000900",1619,"ERA115000900",733,"ERA215000900",996,"ERA225000900",1349,"ERA335000900",1939]
[1050,21,"ERA113001050",565,"ERA213001050",792,"ERA223001050",1063,"ERA333001050",1488,"ERA114001050",714,"ERA214001050",983,"ERA224001050",1328,"ERA334001050",1889,"ERA115001050",855,"ERA215001050",1162,"ERA225001050",1574,"ERA335001050",2262]
[1200,24,"ERA113001200",646,"ERA213001200",905,"ERA223001200",1215,"ERA333001200",1701,"ERA114001200",816,"ERA214001200",1123,"ERA224001200",1518,"ERA334001200",2158,"ERA115001200",977,"ERA215001200",1328,"ERA225001200",1799,"ERA335001200",2586]
[1350,27,"ERA113001350",727,"ERA213001350",1018,"ERA223001350",1367,"ERA333001350",1913,"ERA114001350",918,"ERA214001350",1263,"ERA224001350",1708,"ERA334001350",2428,"ERA115001350",1099,"ERA215001350",1494,"ERA225001350",2024,"ERA335001350",2909]
[1500,30,"ERA113001500",808,"ERA213001500",1132,"ERA223001500",1519,"ERA333001500",2126,"ERA114001500",1020,"ERA214001500",1404,"ERA224001500",1898,"ERA334001500",2698,"ERA115001500",1221,"ERA215001500",1660,"ERA225001500",2249,"ERA335001500",3232]
[1650,33,"ERA113001650",888,"ERA213001650",1245,"ERA223001650",1671,"ERA333001650",2338,"ERA114001650",1122,"ERA214001650",1544,"ERA224001650",2087,"ERA334001650",2968,"ERA115001650",1343,"ERA215001650",1826,"ERA225001650",2474,"ERA335001650",3555]
[1800,36," - "," - ","ERA213001800",1358,"ERA223001800",1823,"ERA333001800",2551," - "," - ","ERA214001800",1684,"ERA224001800",2277,"ERA334001800",3237," - "," - ","ERA215001800",1992,"ERA225001800",2699,"ERA335001800",3878]
[1950,39," - "," - ","ERA213001950",1471,"ERA223001950",1975,"ERA333001950",2764," - "," - ","ERA214001950",1825,"ERA224001950",2467,"ERA334001950",3507," - "," - ","ERA215001950",2158,"ERA225001950",2923,"ERA335001950",4201]
[2100,42," - "," - ","ERA213002100",1584,"ERA223002100",2126,"ERA333002100",2976," - "," - ","ERA214002100",1965,"ERA224002100",2657,"ERA334002100",3777," - "," - ","ERA215002100",2324,"ERA225002100",3148,"ERA335002100",4525]
[2250,45," - "," - ","ERA213002250",1697,"ERA223002250",2278,"ERA333002250",3189," - "," - ","ERA214002250",2106,"ERA224002250",2846,"ERA334002250",4047," - "," - ","ERA215002250",2490,"ERA225002250",3373,"ERA335002250",4848]
[2400,48," - "," - ","ERA213002400",1811,"ERA223002400",2430,"ERA333002400",3401," - "," - ","ERA214002400",2246,"ERA224002400",3036,"ERA334002400",4317," - "," - ","ERA215002400",2656,"ERA225002400",3598,"ERA335002400",5171]
[2550,51," - "," - ","ERA213002550",1924,"ERA223002550",2582,"ERA333002550",3614," - "," - ","ERA214002550",2386,"ERA224002550",3226,"ERA334002550",4586," - "," - ","ERA215002550",2822,"ERA225002550",3823,"ERA335002550",5494]
[2700,54," - "," - ","ERA213002700",2037,"ERA223002700",2734,"ERA333002700",3826," - "," - ","ERA214002700",2527,"ERA224002700",3416,"ERA334002700",4856," - "," - ","ERA215002700",2988,"ERA225002700",4048,"ERA335002700",5817]
[3000,60," - "," - ","ERA213003000",2263,"ERA223003000",3038,"ERA333003000",4252," - "," - ","ERA214003000",2807,"ERA224003000",3795,"ERA334003000",5396," - "," - ","ERA215003000",3320,"ERA225003000",4498,"ERA335003000",6464]
[]
[]
["Hauteur",null,{"$f":"C80","v":600},null,null,null,null,null,null,null,{"$f":"K80","v":750},null,null,null,null,null,null,null,{"$f":"S80","v":900}]
["Type",null,{"$f":"C81","v":"ERA11"},null,{"$f":"E81","v":"ERA21"},null,{"$f":"G81","v":"ERA22"},null,{"$f":"I81","v":"ERA33"},null,{"$f":"K81","v":"ERA11"},null,{"$f":"M81","v":"ERA21"},null,{"$f":"O81","v":"ERA22"},null,{"$f":"Q81","v":"ERA33"},null,{"$f":"S81","v":"ERA11"},null,{"$f":"U81","v":"ERA21"},null,{"$f":"W81","v":"ERA22"},null,{"$f":"Y81","v":"ERA33"}]
["Longueur (mm)","Nombre éléments","Modèle","Puissance (watts)     ","Modèle","Puissance (watts)     ","Modèle","Puissance (watts)     ","Modèle","Puissance (watts)     ","Modèle","Puissance (watts)     ","Modèle","Puissance (watts)     ","Modèle","Puissance (watts)     ","Modèle","Puissance (watts)     ","Modèle","Puissance (watts)     ","Modèle","Puissance (watts)     ","Modèle","Puissance (watts)     ","Modèle","Puissance (watts)     "]
[{"$f":"A83","v":450},{"$f":"B83","v":9},{"$f":"C83","v":"ERA116000450"},{"$f":"IF(D83=\"\",\" - \",IF($B$6<0.7,D83*POWER($B$8/50,C$79),D83*POWER($B$7/50,C$79)))","v":424},{"$f":"E83","v":"ERA216000450"},{"$f":"IF(F83=\"\",\" - \",IF($B$6<0.7,F83*POWER($B$8/50,E$79),F83*POWER($B$7/50,E$79)))","v":571},{"$f":"G83","v":"ERA226000450"},{"$f":"IF(H83=\"\",\" - \",IF($B$6<0.7,H83*POWER($B$8/50,G$79),H83*POWER($B$7/50,G$79)))","v":773},{"$f":"I83","v":"ERA336000450"},{"$f":"IF(J83=\"\",\" - \",IF($B$6<0.7,J83*POWER($B$8/50,I$79),J83*POWER($B$7/50,I$79)))","v":1120},{"$f":"K83","v":"ERA117500450"},{"$f":"IF(L83=\"\",\" - \",IF($B$6<0.7,L83*POWER($B$8/50,K$79),L83*POWER($B$7/50,K$79)))","v":506},{"$f":"M83","v":"ERA217500450"},{"$f":"IF(N83=\"\",\" - \",IF($B$6<0.7,N83*POWER($B$8/50,M$79),N83*POWER($B$7/50,M$79)))","v":676},{"$f":"O83","v":"ERA227500450"},{"$f":"IF(P83=\"\",\" - \",IF($B$6<0.7,P83*POWER($B$8/50,O$79),P83*POWER($B$7/50,O$79)))","v":911},{"$f":"Q83","v":"ERA337500450"},{"$f":"IF(R83=\"\",\" - \",IF($B$6<0.7,R83*POWER($B$8/50,Q$79),R83*POWER($B$7/50,Q$79)))","v":1329},{"$f":"S83","v":"ERA119000450"},{"$f":"IF(T83=\"\",\" - \",IF($B$6<0.7,T83*POWER($B$8/50,S$79),T83*POWER($B$7/50,S$79)))","v":584},{"$f":"U83","v":"ERA219000450"},{"$f":"IF(V83=\"\",\" - \",IF($B$6<0.7,V83*POWER($B$8/50,U$79),V83*POWER($B$7/50,U$79)))","v":776},{"$f":"W83","v":"ERA229000450"},{"$f":"IF(X83=\"\",\" - \",IF($B$6<0.7,X83*POWER($B$8/50,W$79),X83*POWER($B$7/50,W$79)))","v":1037},{"$f":"Y83","v":"ERA339000450"},{"$f":"IF(Z83=\"\",\" - \",IF($B$6<0.7,Z83*POWER($B$8/50,Y$79),Z83*POWER($B$7/50,Y$79)))","v":1521}]
[{"$f":"A84","v":600},12,"ERA116000600",565,"ERA216000600",762,"ERA226000600",1031,"ERA336000600",1493,"ERA117500600",675,"ERA217500600",901,"ERA227500600",1214,"ERA337500600",1772,"ERA119000600",779,"ERA219000600",1034,"ERA229000600",1383,"ERA339000600",2028]
[750,15,"ERA116000750",707,"ERA216000750",952,"ERA226000750",1289,"ERA336000750",1867,"ERA117500750",844,"ERA217500750",1127,"ERA227500750",1518,"ERA337500750",2215,"ERA119000750",974,"ERA219000750",1293,"ERA229000750",1729,"ERA339000750",2535]
[900,18,"ERA116000900",848,"ERA216000900",1142,"ERA226000900",1547,"ERA336000900",2240,"ERA117500900",1013,"ERA217500900",1352,"ERA227500900",1822,"ERA337500900",2658,"ERA119000900",1168,"ERA219000900",1552,"ERA229000900",2075,"ERA339000900",3041]
[1050,21,"ERA116001050",990,"ERA216001050",1333,"ERA226001050",1804,"ERA336001050",2613,"ERA117501050",1181,"ERA217501050",1577,"ERA227501050",2125,"ERA337501050",3101,"ERA119001050",1363,"ERA219001050",1810,"ERA229001050",2421,"ERA339001050",3548]
[1200,24,"ERA116001200",1131,"ERA216001200",1523,"ERA226001200",2062,"ERA336001200",2987,"ERA117501200",1350,"ERA217501200",1802,"ERA227501200",2429,"ERA337501200",3544,"ERA119001200",1558,"ERA219001200",2069,"ERA229001200",2766,"ERA339001200",4055]
[1350,27,"ERA116001350",1272,"ERA216001350",1713,"ERA226001350",2320,"ERA336001350",3360,"ERA117501350",1519,"ERA217501350",2028,"ERA227501350",2732,"ERA337501350",3987,"ERA119001350",1753,"ERA219001350",2327,"ERA229001350",3112,"ERA339001350",4562]
[1500,30,"ERA116001500",1414,"ERA216001500",1904,"ERA226001500",2578,"ERA336001500",3733,"ERA117501500",1688,"ERA217501500",2253,"ERA227501500",3036,"ERA337501500",4430,"ERA119001500",1947,"ERA219001500",2586,"ERA229001500",3458,"ERA339001500",5069]
[1650,33,"ERA116001650",1555,"ERA216001650",2094,"ERA226001650",2835,"ERA336001650",4107,"ERA117501650",1856,"ERA217501650",2478,"ERA227501650",3340,"ERA337501650",4873,"ERA119001650",2142,"ERA219001650",2845,"ERA229001650",3804,"ERA339001650",5576]
[1800,36," - "," - ","ERA216001800",2285,"ERA226001800",3093,"ERA336001800",4480," - "," - ","ERA217501800",2704,"ERA227501800",3643,"ERA337501800",5316," - "," - ","ERA219001800",3103,"ERA229001800",4150,"ERA339001800",6083]
[1950,39," - "," - ","ERA216001950",2475,"ERA226001950",3351,"ERA336001950",4853," - "," - ","ERA217501950",2929,"ERA227501950",3947,"ERA337501950",5759," - "," - ","ERA219001950",3362,"ERA229001950",4496,"ERA339001950",6590]
[2100,42," - "," - ","ERA216002100",2665,"ERA226002100",3609,"ERA336002100",5226," - "," - ","ERA217502100",3154,"ERA227502100",4250,"ERA337502100",6202," - "," - ","ERA219002100",3620,"ERA229002100",4841,"ERA339002100",7097]
[2250,45," - "," - ","ERA216002250",2856,"ERA226002250",3866,"ERA336002250",5600," - "," - ","ERA217502250",3380,"ERA227502250",4554,"ERA337502250",6645," - "," - ","ERA219002250",3879,"ERA229002250",5187,"ERA339002250",7604]
[2400,48," - "," - ","ERA216002400",3046,"ERA226002400",4124,"ERA336002400",5973," - "," - ","ERA217502400",3605,"ERA227502400",4858,"ERA337502400",7088," - "," - ","ERA219002400",4138,"ERA229002400",5533,"ERA339002400",8111]
[2550,51," - "," - ","ERA216002550",3236,"ERA226002550",4382,"ERA336002550",6346," - "," - ","ERA217502550",3830,"ERA227502550",5161,"ERA337502550",7531," - "," - ","ERA219002550",4396,"ERA229002550",5879,"ERA339002550",8617]
[2700,54," - "," - ","ERA216002700",3427,"ERA226002700",4640,"ERA336002700",6720," - "," - ","ERA217502700",4055,"ERA227502700",5465,"ERA337502700",7974," - "," - ","ERA219002700",4655,"ERA229002700",6225,"ERA339002700",9124]
[3000,60," - "," - ","ERA216003000",3808,"ERA226003000",5155,"ERA336003000",7466," - "," - ","ERA217503000",4506,"ERA227503000",6072,"ERA337503000",8860," - "," - ","ERA219003000",5172,"ERA229003000",6916,"ERA339003000",10138]
[]
[]
["Tableau de référence"]
[]
["PENTE :",null,1.3435999999999999,null,1.3096000000000001,null,1.3153999999999999,null,1.3144,null,1.3382000000000001,null,1.3209,null,1.3208,null,1.3224,null,1.3329,null,1.3322000000000001,null,1.3261000000000001,null,1.3323]
["Hauteur",null,300,null,null,null,null,null,null,null,400,null,null,null,null,null,null,null,500]
["Type",null,"ERA11",null,"ERA21",null,"ERA22",null,"ERA33",null,"ERA11",null,"ERA21",null,"ERA22",null,"ERA33",null,"ERA11",null,"ERA21",null,"ERA22",null,"ERA33"]
["Longueur (mm)","Nombre éléments","Modèle","Watt \nDt 50°C","Modèle","Watt \nDt 50°C","Modèle","Watt \nDt 50°C","Modèle","Watt \nDt 50°C","Modèle","Watt \nDt 50°C","Modèle","Watt \nDt 50°C","Modèle","Watt \nDt 50°C","Modèle","Watt \nDt 50°C","Modèle","Watt \nDt 50°C","Modèle","Watt \nDt 50°C","Modèle","Watt \nDt 50°C","Modèle","Watt \nDt 50°C"]
[450,{"$f":"A61/50","v":9},{"$f":"IF(D61=\"\",\" - \",IF(LEN($A61)=3,C$59&$C$58&\"0\"&$A61,C$59&$C$58&$A61))","v":"ERA113000450"},242,{"$f":"IF(F61=\"\",\" - \",IF(LEN($A61)=3,E$59&$C$58&\"0\"&$A61,E$59&$C$58&$A61))","v":"ERA213000450"},339,{"$f":"IF(H61=\"\",\" - \",IF(LEN($A61)=3,G$59&$C$58&\"0\"&$A61,G$59&$C$58&$A61))","v":"ERA223000450"},456,{"$f":"IF(J61=\"\",\" - \",IF(LEN($A61)=3,I$59&$C$58&\"0\"&$A61,I$59&$C$58&$A61))","v":"ERA333000450"},638,{"$f":"IF(L61=\"\",\" - \",IF(LEN($A61)=3,K$59&$K$58&\"0\"&$A61,K$59&$K$58&$A61))","v":"ERA114000450"},306,{"$f":"IF(N61=\"\",\" - \",IF(LEN($A61)=3,M$59&$K$58&\"0\"&$A61,M$59&$K$58&$A61))","v":"ERA214000450"},421,{"$f":"IF(P61=\"\",\" - \",IF(LEN($A61)=3,O$59&$K$58&\"0\"&$A61,O$59&$K$58&$A61))","v":"ERA224000450"},569,{"$f":"IF(R61=\"\",\" - \",IF(LEN($A61)=3,Q$59&$K$58&\"0\"&$A61,Q$59&$K$58&$A61))","v":"ERA334000450"},809,{"$f":"IF(T61=\"\",\" - \",IF(LEN($A61)=3,S$59&$S$58&\"0\"&$A61,S$59&$S$58&$A61))","v":"ERA115000450"},366,{"$f":"IF(V61=\"\",\" - \",IF(LEN($A61)=3,U$59&$S$58&\"0\"&$A61,U$59&$S$58&$A61))","v":"ERA215000450"},498,{"$f":"IF(X61=\"\",\" - \",IF(LEN($A61)=3,W$59&$S$58&\"0\"&$A61,W$59&$S$58&$A61))","v":"ERA225000450"},675,{"$f":"IF(Z61=\"\",\" - \",IF(LEN($A61)=3,Y$59&$S$58&\"0\"&$A61,Y$59&$S$58&$A61))","v":"ERA335000450"},970]
[600,{"$f":"A62/50","v":12},"ERA113000600",323,"ERA213000600",453,"ERA223000600",608,"ERA333000600",850,"ERA114000600",408,"ERA214000600",561,"ERA224000600",759,"ERA334000600",1079,{"$f":"IF(T62=\"\",\" - \",IF(LEN($A62)=3,S$59&$S$58&\"0\"&$A62,S$59&$S$58&$A62))","v":"ERA115000600"},489,"ERA215000600",664,"ERA225000600",900,"ERA335000600",1293]
[750,15,"ERA113000750",404,"ERA213000750",566,"ERA223000750",759,"ERA333000750",1063,"ERA114000750",510,"ERA214000750",702,"ERA224000750",949,"ERA334000750",1349,"ERA115000750",611,"ERA215000750",830,"ERA225000750",1124,"ERA335000750",1616]
[900,18,"ERA113000900",485,"ERA213000900",679,"ERA223000900",911,"ERA333000900",1275,"ERA114000900",612,"ERA214000900",842,"ERA224000900",1139,"ERA334000900",1619,"ERA115000900",733,"ERA215000900",996,"ERA225000900",1349,"ERA335000900",1939]
[1050,21,"ERA113001050",565,"ERA213001050",792,"ERA223001050",1063,"ERA333001050",1488,"ERA114001050",714,"ERA214001050",983,"ERA224001050",1328,"ERA334001050",1889,"ERA115001050",855,"ERA215001050",1162,"ERA225001050",1574,"ERA335001050",2262]
[1200,24,"ERA113001200",646,"ERA213001200",905,"ERA223001200",1215,"ERA333001200",1701,"ERA114001200",816,"ERA214001200",1123,"ERA224001200",1518,"ERA334001200",2158,"ERA115001200",977,"ERA215001200",1328,"ERA225001200",1799,"ERA335001200",2586]
[1350,27,"ERA113001350",727,"ERA213001350",1018,"ERA223001350",1367,"ERA333001350",1913,"ERA114001350",918,"ERA214001350",1263,"ERA224001350",1708,"ERA334001350",2428,"ERA115001350",1099,"ERA215001350",1494,"ERA225001350",2024,"ERA335001350",2909]
[1500,30,"ERA113001500",808,"ERA213001500",1132,"ERA223001500",1519,"ERA333001500",2126,"ERA114001500",1020,"ERA214001500",1404,"ERA224001500",1898,"ERA334001500",2698,"ERA115001500",1221,"ERA215001500",1660,"ERA225001500",2249,"ERA335001500",3232]
[1650,33,"ERA113001650",888,"ERA213001650",1245,"ERA223001650",1671,"ERA333001650",2338,"ERA114001650",1122,"ERA214001650",1544,"ERA224001650",2087,"ERA334001650",2968,"ERA115001650",1343,"ERA215001650",1826,"ERA225001650",2474,"ERA335001650",3555]
[1800,36," - ",null,"ERA213001800",1358,"ERA223001800",1823,"ERA333001800",2551," - ",null,"ERA214001800",1684,"ERA224001800",2277,"ERA334001800",3237," - ",null,"ERA215001800",1992,"ERA225001800",2699,"ERA335001800",3878]
[1950,39," - ",null,"ERA213001950",1471,"ERA223001950",1975,"ERA333001950",2764," - ",null,"ERA214001950",1825,"ERA224001950",2467,"ERA334001950",3507," - ",null,"ERA215001950",2158,"ERA225001950",2923,"ERA335001950",4201]
[2100,42," - ",null,"ERA213002100",1584,"ERA223002100",2126,"ERA333002100",2976," - ",null,"ERA214002100",1965,"ERA224002100",2657,"ERA334002100",3777," - ",null,"ERA215002100",2324,"ERA225002100",3148,"ERA335002100",4525]
[2250,45," - ",null,"ERA213002250",1697,"ERA223002250",2278,"ERA333002250",3189," - ",null,"ERA214002250",2106,"ERA224002250",2846,"ERA334002250",4047," - ",null,"ERA215002250",2490,"ERA225002250",3373,"ERA335002250",4848]
[2400,48," - ",null,"ERA213002400",1811,"ERA223002400",2430,"ERA333002400",3401," - ",null,"ERA214002400",2246,"ERA224002400",3036,"ERA334002400",4317," - ",null,"ERA215002400",2656,"ERA225002400",3598,"ERA335002400",5171]
[2550,51," - ",null,"ERA213002550",1924,"ERA223002550",2582,"ERA333002550",3614," - ",null,"ERA214002550",2386,"ERA224002550",3226,"ERA334002550",4586," - ",null,"ERA215002550",2822,"ERA225002550",3823,"ERA335002550",5494]
[2700,54," - ",null,"ERA213002700",2037,"ERA223002700",2734,"ERA333002700",3826," - ",null,"ERA214002700",2527,"ERA224002700",3416,"ERA334002700",4856," - ",null,"ERA215002700",2988,"ERA225002700",4048,"ERA335002700",5817]
[3000,60," - ",null,"ERA213003000",2263,"ERA223003000",3038,"ERA333003000",4252," - ",null,"ERA214003000",2807,"ERA224003000",3795,"ERA334003000",5396," - ",null,"ERA215003000",3320,"ERA225003000",4498,"ERA335003000",6464]
[]
["PENTE :",null,1.3274999999999999,null,1.3434999999999999,null,1.3314999999999999,null,1.3412999999999999,null,1.3224,null,1.3584000000000001,null,1.3496999999999999,null,1.3595999999999999,null,1.3171999999999999,null,1.3732,null,1.3677999999999999,null,1.3778999999999999,null,null,null,null,null,null,null,null,null,null,null,null,null,null,null,null,null,null,1.3540000000000001]
["Hauteur",null,600,null,null,null,null,null,null,null,750,null,null,null,null,null,null,null,900]
["Type",null,"ERA11",null,"ERA21",null,"ERA22",null,"ERA33",null,"ERA11",null,"ERA21",null,"ERA22",null,"ERA33",null,"ERA11",null,"ERA21",null,"ERA22",null,"ERA33"]
["Longueur (mm)","Nombre éléments","Modèle","Watt \nDt 50°C","Modèle","Watt \nDt 50°C","Modèle","Watt \nDt 50°C","Modèle","Watt \nDt 50°C","Modèle","Watt \nDt 50°C","Modèle","Watt \nDt 50°C","Modèle","Watt \nDt 50°C","Modèle","Watt \nDt 50°C","Modèle",null,"Modèle","Watt \nDt 50°C","Modèle","Watt \nDt 50°C","Modèle","Watt \nDt 50°C"]
[450,{"$f":"A83/50","v":9},{"$f":"IF(D83=\"\",\" - \",IF(LEN($A61)=3,C$81&$C$80&\"0\"&$A61,C$81&$C$80&$A61))","v":"ERA116000450"},424,{"$f":"IF(F83=\"\",\" - \",IF(LEN($A61)=3,E$81&$C$80&\"0\"&$A61,E$81&$C$80&$A61))","v":"ERA216000450"},571,{"$f":"IF(H83=\"\",\" - \",IF(LEN($A61)=3,G$81&$C$80&\"0\"&$A61,G$81&$C$80&$A61))","v":"ERA226000450"},773,{"$f":"IF(J83=\"\",\" - \",IF(LEN($A61)=3,I$81&$C$80&\"0\"&$A61,I$81&$C$80&$A61))","v":"ERA336000450"},1120,{"$f":"IF(L83=\"\",\" - \",IF(LEN($A83)=3,K$81&$K$80&\"0\"&$A83,K$81&$K$80&$A83))","v":"ERA117500450"},506,{"$f":"IF(N83=\"\",\" - \",IF(LEN($A83)=3,M$81&$K$80&\"0\"&$A83,M$81&$K$80&$A83))","v":"ERA217500450"},676,{"$f":"IF(P83=\"\",\" - \",IF(LEN($A83)=3,O$81&$K$80&\"0\"&$A83,O$81&$K$80&$A83))","v":"ERA227500450"},911,{"$f":"IF(R83=\"\",\" - \",IF(LEN($A83)=3,Q$81&$K$80&\"0\"&$A83,Q$81&$K$80&$A83))","v":"ERA337500450"},1329,{"$f":"IF(T83=\"\",\" - \",IF(LEN($A83)=3,S$81&$S$80&\"0\"&$A83,S$81&$S$80&$A83))","v":"ERA119000450"},584,{"$f":"IF(V83=\"\",\" - \",IF(LEN($A83)=3,U$81&$S$80&\"0\"&$A83,U$81&$S$80&$A83))","v":"ERA219000450"},776,{"$f":"IF(X83=\"\",\" - \",IF(LEN($A83)=3,W$81&$S$80&\"0\"&$A83,W$81&$S$80&$A83))","v":"ERA229000450"},1037,{"$f":"IF(Z83=\"\",\" - \",IF(LEN($A83)=3,Y$81&$S$80&\"0\"&$A83,Y$81&$S$80&$A83))","v":"ERA339000450"},1521]
[600,{"$f":"A84/50","v":12},"ERA116000600",565,"ERA216000600",762,"ERA226000600",1031,"ERA336000600",1493,"ERA117500600",675,"ERA217500600",901,"ERA227500600",1214,"ERA337500600",1772,"ERA119000600",779,"ERA219000600",1034,"ERA229000600",1383,"ERA339000600",2028]
[750,15,"ERA116000750",707,"ERA216000750",952,"ERA226000750",1289,"ERA336000750",1867,"ERA117500750",844,"ERA217500750",1127,"ERA227500750",1518,"ERA337500750",2215,"ERA119000750",974,"ERA219000750",1293,"ERA229000750",1729,"ERA339000750",2535]
[900,18,"ERA116000900",848,"ERA216000900",1142,"ERA226000900",1547,"ERA336000900",2240,"ERA117500900",1013,"ERA217500900",1352,"ERA227500900",1822,"ERA337500900",2658,"ERA119000900",1168,"ERA219000900",1552,"ERA229000900",2075,"ERA339000900",3041]
[1050,21,"ERA116001050",990,"ERA216001050",1333,"ERA226001050",1804,"ERA336001050",2613,"ERA117501050",1181,"ERA217501050",1577,"ERA227501050",2125,"ERA337501050",3101,"ERA119001050",1363,"ERA219001050",1810,"ERA229001050",2421,"ERA339001050",3548]
[1200,24,"ERA116001200",1131,"ERA216001200",1523,"ERA226001200",2062,"ERA336001200",2987,"ERA117501200",1350,"ERA217501200",1802,"ERA227501200",2429,"ERA337501200",3544,"ERA119001200",1558,"ERA219001200",2069,"ERA229001200",2766,"ERA339001200",4055]
[1350,27,"ERA116001350",1272,"ERA216001350",1713,"ERA226001350",2320,"ERA336001350",3360,"ERA117501350",1519,"ERA217501350",2028,"ERA227501350",2732,"ERA337501350",3987,"ERA119001350",1753,"ERA219001350",2327,"ERA229001350",3112,"ERA339001350",4562]
[1500,30,"ERA116001500",1414,"ERA216001500",1904,"ERA226001500",2578,"ERA336001500",3733,"ERA117501500",1688,"ERA217501500",2253,"ERA227501500",3036,"ERA337501500",4430,"ERA119001500",1947,"ERA219001500",2586,"ERA229001500",3458,"ERA339001500",5069]
[1650,33,"ERA116001650",1555,"ERA216001650",2094,"ERA226001650",2835,"ERA336001650",4107,"ERA117501650",1856,"ERA217501650",2478,"ERA227501650",3340,"ERA337501650",4873,"ERA119001650",2142,"ERA219001650",2845,"ERA229001650",3804,"ERA339001650",5576]
[1800,36," - ",null,"ERA216001800",2285,"ERA226001800",3093,"ERA336001800",4480," - ",null,"ERA217501800",2704,"ERA227501800",3643,"ERA337501800",5316," - ",null,"ERA219001800",3103,"ERA229001800",4150,"ERA339001800",6083]
[1950,39," - ",null,"ERA216001950",2475,"ERA226001950",3351,"ERA336001950",4853," - ",null,"ERA217501950",2929,"ERA227501950",3947,"ERA337501950",5759," - ",null,"ERA219001950",3362,"ERA229001950",4496,"ERA339001950",6590]
[2100,42," - ",null,"ERA216002100",2665,"ERA226002100",3609,"ERA336002100",5226," - ",null,"ERA217502100",3154,"ERA227502100",4250,"ERA337502100",6202," - ",null,"ERA219002100",3620,"ERA229002100",4841,"ERA339002100",7097]
[2250,45," - ",null,"ERA216002250",2856,"ERA226002250",3866,"ERA336002250",5600," - ",null,"ERA217502250",3380,"ERA227502250",4554,"ERA337502250",6645," - ",null,"ERA219002250",3879,"ERA229002250",5187,"ERA339002250",7604]
[2400,48," - ",null,"ERA216002400",3046,"ERA226002400",4124,"ERA336002400",5973," - ",null,"ERA217502400",3605,"ERA227502400",4858,"ERA337502400",7088," - ",null,"ERA219002400",4138,"ERA229002400",5533,"ERA339002400",8111]
[2550,51," - ",null,"ERA216002550",3236,"ERA226002550",4382,"ERA336002550",6346," - ",null,"ERA217502550",3830,"ERA227502550",5161,"ERA337502550",7531," - ",null,"ERA219002550",4396,"ERA229002550",5879,"ERA339002550",8617]
[2700,54," - ",null,"ERA216002700",3427,"ERA226002700",4640,"ERA336002700",6720," - ",null,"ERA217502700",4055,"ERA227502700",5465,"ERA337502700",7974," - ",null,"ERA219002700",4655,"ERA229002700",6225,"ERA339002700",9124]
[3000,60," - ",null,"ERA216003000",3808,"ERA226003000",5155,"ERA336003000",7466," - ",null,"ERA217503000",4506,"ERA227503000",6072,"ERA337503000",8860," - ",null,"ERA219003000",5172,"ERA229003000",6916,"ERA339003000",10138]

{"sheet":"INTEGRA","index":6,"n_rows":100,"n_cols":26,"rows_kept":100,"cut":false,"hidden":false,"merged":[[81,14,81,15],[81,0,81,1],[81,18,81,19],[81,20,81,21],[81,22,81,23],[81,24,81,25],[81,16,81,17],[80,0,80,1],[58,18,58,25],[80,2,80,9],[80,10,80,17],[80,18,80,25],[79,18,79,19],[79,20,79,21],[79,22,79,23],[79,24,79,25],[81,2,81,3],[79,8,79,9],[79,10,79,11],[79,12,79,13],[59,10,59,11],[59,12,59,13],[81,4,81,5],[81,6,81,7],[81,8,81,9],[81,10,81,11],[81,12,81,13],[57,22,57,23],[57,24,57,25],[79,2,79,3],[79,4,79,5],[79,6,79,7],[59,18,59,19],[59,20,59,21],[59,22,59,23],[59,24,59,25],[59,16,59,17],[59,14,59,15],[79,14,79,15],[79,16,79,17],[79,0,79,1],[57,18,57,19],[57,20,57,21],[57,12,57,13],[57,14,57,15],[57,16,57,17],[57,0,57,1],[57,2,57,3],[57,4,57,5],[57,6,57,7],[57,8,57,9],[57,10,57,11],[58,0,58,1],[58,2,58,9],[58,10,58,17],[59,0,59,1],[59,2,59,3],[59,4,59,5],[59,6,59,7],[59,8,59,9],[11,18,11,19],[11,20,11,21],[11,22,11,23],[11,24,11,25],[33,2,33,3],[10,0,10,1],[10,2,10,9],[10,10,10,17],[33,16,33,17],[32,18,32,25],[33,18,33,19],[33,20,33,21],[33,22,33,23],[33,24,33,25],[33,4,33,5],[33,6,33,7],[33,8,33,9],[33,10,33,11],[33,12,33,13],[33,14,33,15],[33,0,33,1],[2,2,2,6],[3,2,3,6],[4,2,4,6],[32,0,32,1],[10,18,10,25],[32,2,32,9],[32,10,32,17],[11,0,11,1],[11,2,11,3],[11,4,11,5],[11,6,11,7],[11,8,11,9],[11,10,11,11],[11,12,11,13],[11,14,11,15],[11,16,11,17]]}
["Programme de calcul de la puissance thermique: INTEGRA"]
[]
["Te",75,"<= Entrez la température à l'entrée en C°"]
["Ts",65,"<= Entrez la température à la sortie en C°"]
["Ti",20,"<= Entrez la température ambiante en C°"]
["Rapport",{"$f":"(B4-B5)/(B3-B5)","v":0.81818181818181823}]
["Delta T",{"$f":"((B3+B4)/2)-B5","v":50}]
["Delta T2",{"$f":"(B3-B4)/LN((B3-B5)/(B4-B5))","v":49.83288654563971},"Si Rapport < 0,7"]
[]
[]
["Hauteur",null,{"$f":"C59","v":300},null,null,null,null,null,null,null,{"$f":"K59","v":400},null,null,null,null,null,null,null,{"$f":"S59","v":500}]
["Type",null,{"$f":"C60","v":"INT11"},null,{"$f":"E60","v":"INT21"},null,{"$f":"G60","v":"INT22"},null,{"$f":"I60","v":"INT33"},null,{"$f":"K60","v":"INT11"},null,{"$f":"M60","v":"INT21"},null,{"$f":"O60","v":"INT22"},null,{"$f":"Q60","v":"INT33"},null,{"$f":"S60","v":"INT11"},null,{"$f":"U60","v":"INT21"},null,{"$f":"W60","v":"INT22"},null,{"$f":"Y60","v":"INT33"}]
["Longueur (mm)","Nombre éléments","Modèle","Puissance (watts)     ","Modèle","Puissance (watts)     ","Modèle","Puissance (watts)     ","Modèle","Puissance (watts)     ","Modèle","Puissance (watts)     ","Modèle","Puissance (watts)     ","Modèle","Puissance (watts)     ","Modèle","Puissance (watts)     ","Modèle","Puissance (watts)     ","Modèle","Puissance (watts)     ","Modèle","Puissance (watts)     ","Modèle","Puissance (watts)     "]
[{"$f":"A62","v":450},{"$f":"B62","v":9},{"$f":"C62","v":"INT113000450"},{"$f":"IF(D62=\"\",\" - \",IF($B$6<0.7,D62*POWER($B$8/50,C$58),D62*POWER($B$7/50,C$58)))","v":248},{"$f":"E62","v":"INT213000450"},{"$f":"IF(F62=\"\",\" - \",IF($B$6<0.7,F62*POWER($B$8/50,E$58),F62*POWER($B$7/50,E$58)))","v":361},{"$f":"G62","v":"INT223000450"},{"$f":"IF(H62=\"\",\" - \",IF($B$6<0.7,H62*POWER($B$8/50,G$58),H62*POWER($B$7/50,G$58)))","v":474},{"$f":"I62","v":"INT333000450"},{"$f":"IF(J62=\"\",\" - \",IF($B$6<0.7,J62*POWER($B$8/50,I$58),J62*POWER($B$7/50,I$58)))","v":672},{"$f":"K62","v":"INT114000450"},{"$f":"IF(L62=\"\",\" - \",IF($B$6<0.7,L62*POWER($B$8/50,K$58),L62*POWER($B$7/50,K$58)))","v":318},{"$f":"M62","v":"INT214000450"},{"$f":"IF(N62=\"\",\" - \",IF($B$6<0.7,N62*POWER($B$8/50,M$58),N62*POWER($B$7/50,M$58)))","v":448},{"$f":"O62","v":"INT224000450"},{"$f":"IF(P62=\"\",\" - \",IF($B$6<0.7,P62*POWER($B$8/50,O$58),P62*POWER($B$7/50,O$58)))","v":601},{"$f":"Q62","v":"INT334000450"},{"$f":"IF(R62=\"\",\" - \",IF($B$6<0.7,R62*POWER($B$8/50,Q$58),R62*POWER($B$7/50,Q$58)))","v":863},{"$f":"S62","v":"INT115000450"},{"$f":"IF(T62=\"\",\" - \",IF($B$6<0.7,T62*POWER($B$8/50,S$58),T62*POWER($B$7/50,S$58)))","v":384},{"$f":"U62","v":"INT215000450"},{"$f":"IF(V62=\"\",\" - \",IF($B$6<0.7,V62*POWER($B$8/50,U$58),V62*POWER($B$7/50,U$58)))","v":530},{"$f":"W62","v":"INT225000450"},{"$f":"IF(X62=\"\",\" - \",IF($B$6<0.7,X62*POWER($B$8/50,W$58),X62*POWER($B$7/50,W$58)))","v":718},{"$f":"Y62","v":"INT335000450"},{"$f":"IF(Z62=\"\",\" - \",IF($B$6<0.7,Z62*POWER($B$8/50,Y$58),Z62*POWER($B$7/50,Y$58)))","v":1037}]
[{"$f":"A63","v":600},12,"INT113000600",331,{"$f":"E63","v":"INT213000600"},481,{"$f":"G63","v":"INT223000600"},632,{"$f":"I63","v":"INT333000600"},896,{"$f":"K63","v":"INT114000600"},424,{"$f":"M63","v":"INT214000600"},598,{"$f":"O63","v":"INT224000600"},802,{"$f":"Q63","v":"INT334000600"},1151,"INT115000600",512,"INT215000600",706,"INT225000600",957,"INT335000600",1383]
[750,15,"INT113000750",413,"INT213000750",602,"INT223000750",790,"INT333000750",1121,"INT114000750",530,"INT214000750",747,"INT224000750",1002,"INT334000750",1439,"INT115000750",640,"INT215000750",883,"INT225000750",1196,"INT335000750",1729]
[900,18,"INT113000900",496,"INT213000900",722,"INT223000900",948,"INT333000900",1345,"INT114000900",635,"INT214000900",896,"INT224000900",1202,"INT334000900",1726,"INT115000900",768,"INT215000900",1059,"INT225000900",1436,"INT335000900",2075]
[1050,21,"INT113001050",579,"INT213001050",842,"INT223001050",1106,"INT333001050",1569,"INT114001050",741,"INT214001050",1046,"INT224001050",1403,"INT334001050",2014,"INT115001050",896,"INT215001050",1236,"INT225001050",1675,"INT335001050",2420]
[1200,24,"INT113001200",661,"INT213001200",962,"INT223001200",1264,"INT333001200",1793,"INT114001200",847,"INT214001200",1195,"INT224001200",1603,"INT334001200",2302,"INT115001200",1024,"INT215001200",1412,"INT225001200",1914,"INT335001200",2766]
[1350,27,"INT113001350",744,"INT213001350",1083,"INT223001350",1422,"INT333001350",2017,"INT114001350",953,"INT214001350",1345,"INT224001350",1804,"INT334001350",2589,"INT115001350",1152,"INT215001350",1589,"INT225001350",2153,"INT335001350",3112]
[1500,30,"INT113001500",827,"INT213001500",1203,"INT223001500",1580,"INT333001500",2241,"INT114001500",1059,"INT214001500",1494,"INT224001500",2004,"INT334001500",2877,"INT115001500",1280,"INT215001500",1766,"INT225001500",2393,"INT335001500",3458]
[1650,33,"INT113001650",909,"INT213001650",1323,"INT223001650",1737,"INT333001650",2465,"INT114001650",1165,"INT214001650",1643,"INT224001650",2204,"INT334001650",3165,"INT115001650",1407,"INT215001650",1942,"INT225001650",2632,"INT335001650",3803]
[1800,36,"INT113001800",992,"INT213001800",1444,"INT223001800",1895,"INT333001800",2689,"INT114001800",1271,"INT214001800",1793,"INT224001800",2405,"INT334001800",3452,"INT115001800",1535,"INT215001800",2119,"INT225001800",2871,"INT335001800",4149]
[1950,39,"INT113001950",1074,"INT213001950",1564,"INT223001950",2053,"INT333001950",2913,"INT114001950",1377,"INT214001950",1942,"INT224001950",2605,"INT334001950",3740,"INT115001950",1663,"INT215001950",2295,"INT225001950",3110,"INT335001950",4495]
[2100,42,"INT113002100",1157,"INT213002100",1684,"INT223002100",2211,"INT333002100",3137,"INT114002100",1483,"INT214002100",2092,"INT224002100",2806,"INT334002100",4028,"INT115002100",1791,"INT215002100",2472,"INT225002100",3350,"INT335002100",4841]
[2250,45,"INT113002250",1240,"INT213002250",1805,"INT223002250",2369,"INT333002250",3362,"INT114002250",1589,"INT214002250",2241,"INT224002250",3006,"INT334002250",4316,"INT115002250",1919,"INT215002250",2648,"INT225002250",3589,"INT335002250",5186]
[2400,48,"INT113002400",1322,"INT213002400",1925,"INT223002400",2527,"INT333002400",3586,"INT114002400",1694,"INT214002400",2390,"INT224002400",3206,"INT334002400",4603,"INT115002400",2047,"INT215002400",2825,"INT225002400",3828,"INT335002400",5532]
[2550,51,"INT113002550",1405,"INT213002550",2045,"INT223002550",2685,"INT333002550",3810,"INT114002550",1800,"INT214002550",2540,"INT224002550",3407,"INT334002550",4891,"INT115002550",2175,"INT215002550",3001,"INT225002550",4067,"INT335002550",5878]
[2700,54,"INT113002700",1488,"INT213002700",2165,"INT223002700",2843,"INT333002700",4034,"INT114002700",1906,"INT214002700",2689,"INT224002700",3607,"INT334002700",5179,"INT115002700",2303,"INT215002700",3178,"INT225002700",4307,"INT335002700",6224]
[3000,60,"INT113003000",1653,"INT213003000",2406,"INT223003000",3159,"INT333003000",4482,"INT114003000",2118,"INT214003000",2988,"INT224003000",4008,"INT334003000",5754,"INT115003000",2559,"INT215003000",3531,"INT225003000",4785,"INT335003000",6915]
[]
[]
["Hauteur",null,{"$f":"C81","v":600},null,null,null,null,null,null,null,{"$f":"K81","v":750},null,null,null,null,null,null,null,{"$f":"S81","v":900}]
["Type",null,{"$f":"C82","v":"INT11"},null,{"$f":"E82","v":"INT21"},null,{"$f":"G82","v":"INT22"},null,{"$f":"I82","v":"INT33"},null,{"$f":"K82","v":"INT11"},null,{"$f":"M82","v":"INT21"},null,{"$f":"O82","v":"INT22"},null,{"$f":"Q82","v":"INT33"},null,{"$f":"S82","v":"INT11"},null,{"$f":"U82","v":"INT21"},null,{"$f":"W82","v":"INT22"},null,{"$f":"Y82","v":"INT33"}]
["Longueur (mm)","Nombre éléments","Modèle","Puissance (watts)     ","Modèle","Puissance (watts)     ","Modèle","Puissance (watts)     ","Modèle","Puissance (watts)     ","Modèle","Puissance (watts)     ","Modèle","Puissance (watts)     ","Modèle","Puissance (watts)     ","Modèle","Puissance (watts)     ","Modèle","Puissance (watts)     ","Modèle","Puissance (watts)     ","Modèle","Puissance (watts)     ","Modèle","Puissance (watts)     "]
[{"$f":"A84","v":450},{"$f":"B84","v":9},{"$f":"C84","v":"INT116000450"},{"$f":"IF(D84=\"\",\" - \",IF($B$6<0.7,D84*POWER($B$8/50,C$80),D84*POWER($B$7/50,C$80)))","v":446},{"$f":"E84","v":"INT216000450"},{"$f":"IF(F84=\"\",\" - \",IF($B$6<0.7,F84*POWER($B$8/50,E$80),F84*POWER($B$7/50,E$80)))","v":607},{"$f":"G84","v":"INT226000450"},{"$f":"IF(H84=\"\",\" - \",IF($B$6<0.7,H84*POWER($B$8/50,G$80),H84*POWER($B$7/50,G$80)))","v":824},{"$f":"I84","v":"INT336000450"},{"$f":"IF(J84=\"\",\" - \",IF($B$6<0.7,J84*POWER($B$8/50,I$80),J84*POWER($B$7/50,I$80)))","v":1195},{"$f":"K84","v":"INT117500450"},{"$f":"IF(L84=\"\",\" - \",IF($B$6<0.7,L84*POWER($B$8/50,K$80),L84*POWER($B$7/50,K$80)))","v":534},{"$f":"M84","v":"INT217500450"},{"$f":"IF(N84=\"\",\" - \",IF($B$6<0.7,N84*POWER($B$8/50,M$80),N84*POWER($B$7/50,M$80)))","v":718},{"$f":"O84","v":"INT227500450"},{"$f":"IF(P84=\"\",\" - \",IF($B$6<0.7,P84*POWER($B$8/50,O$80),P84*POWER($B$7/50,O$80)))","v":968},{"$f":"Q84","v":"INT337500450"},{"$f":"IF(R84=\"\",\" - \",IF($B$6<0.7,R84*POWER($B$8/50,Q$80),R84*POWER($B$7/50,Q$80)))","v":1404},{"$f":"S84","v":"INT119000450"},{"$f":"IF(T84=\"\",\" - \",IF($B$6<0.7,T84*POWER($B$8/50,S$80),T84*POWER($B$7/50,S$80)))","v":616},{"$f":"U84","v":"INT219000450"},{"$f":"IF(V84=\"\",\" - \",IF($B$6<0.7,V84*POWER($B$8/50,U$80),V84*POWER($B$7/50,U$80)))","v":823},{"$f":"W84","v":"INT229000450"},{"$f":"IF(X84=\"\",\" - \",IF($B$6<0.7,X84*POWER($B$8/50,W$80),X84*POWER($B$7/50,W$80)))","v":1092},{"$f":"Y84","v":"INT339000450"},{"$f":"IF(Z84=\"\",\" - \",IF($B$6<0.7,Z84*POWER($B$8/50,Y$80),Z84*POWER($B$7/50,Y$80)))","v":1580}]
[{"$f":"A85","v":600},12,{"$f":"C85","v":"INT116000600"},595,"INT216000600",809,"INT226000600",1099,"INT336000600",1594,"INT117500600",712,"INT217500600",957,"INT227500600",1290,"INT337500600",1871,"INT119000600",821,"INT219000600",1097,"INT229000600",1456,"INT339000600",2107]
[750,15,"INT116000750",744,"INT216000750",1012,"INT226000750",1374,"INT336000750",1992,"INT117500750",890,"INT217500750",1196,"INT227500750",1613,"INT337500750",2339,"INT119000750",1026,"INT219000750",1372,"INT229000750",1820,"INT339000750",2634]
[900,18,"INT116000900",893,"INT216000900",1214,"INT226000900",1649,"INT336000900",2390,"INT117500900",1068,"INT217500900",1436,"INT227500900",1935,"INT337500900",2807,"INT119000900",1231,"INT219000900",1646,"INT229000900",2184,"INT339000900",3161]
[1050,21,"INT116001050",1042,"INT216001050",1416,"INT226001050",1924,"INT336001050",2789,"INT117501050",1246,"INT217501050",1675,"INT227501050",2258,"INT337501050",3275,"INT119001050",1436,"INT219001050",1920,"INT229001050",2548,"INT339001050",3688]
[1200,24,"INT116001200",1190,"INT216001200",1619,"INT226001200",2198,"INT336001200",3187,"INT117501200",1424,"INT217501200",1914,"INT227501200",2580,"INT337501200",3743,"INT119001200",1642,"INT219001200",2195,"INT229001200",2912,"INT339001200",4214]
[1350,27,"INT116001350",1339,"INT216001350",1821,"INT226001350",2473,"INT336001350",3586,"INT117501350",1602,"INT217501350",2153,"INT227501350",2903,"INT337501350",4211,"INT119001350",1847,"INT219001350",2469,"INT229001350",3276,"INT339001350",4741]
[1500,30,"INT116001500",1488,"INT216001500",2024,"INT226001500",2748,"INT336001500",3984,"INT117501500",1781,"INT217501500",2393,"INT227501500",3225,"INT337501500",4679,"INT119001500",2052,"INT219001500",2744,"INT229001500",3641,"INT339001500",5268]
[1650,33,"INT116001650",1637,"INT216001650",2226,"INT226001650",3023,"INT336001650",4382,"INT117501650",1959,"INT217501650",2632,"INT227501650",3548,"INT337501650",5146,"INT119001650",2257,"INT219001650",3018,"INT229001650",4005,"INT339001650",5795]
[1800,36,"INT116001800",1786,"INT216001800",2428,"INT226001800",3298,"INT336001800",4781,"INT117501800",2137,"INT217501800",2871,"INT227501800",3870,"INT337501800",5614,"INT119001800",2462,"INT219001800",3292,"INT229001800",4369,"INT339001800",6322]
[1950,39,"INT116001950",1934,"INT216001950",2631,"INT226001950",3572,"INT336001950",5179,"INT117501950",2315,"INT217501950",3110,"INT227501950",4193,"INT337501950",6082,"INT119001950",2668,"INT219001950",3567,"INT229001950",4733,"INT339001950",6848]
[2100,42,"INT116002100",2083,"INT216002100",2833,"INT226002100",3847,"INT336002100",5578,"INT117502100",2493,"INT217502100",3350,"INT227502100",4515,"INT337502100",6550,"INT119002100",2873,"INT219002100",3841,"INT229002100",5097,"INT339002100",7375]
[2250,45,"INT116002250",2232,"INT216002250",3035,"INT226002250",4122,"INT336002250",5976,"INT117502250",2671,"INT217502250",3589,"INT227502250",4838,"INT337502250",7018,"INT119002250",3078,"INT219002250",4115,"INT229002250",5461,"INT339002250",7902]
[2400,48,"INT116002400",2381,"INT216002400",3238,"INT226002400",4397,"INT336002400",6374,"INT117502400",2849,"INT217502400",3828,"INT227502400",5160,"INT337502400",7486,"INT119002400",3283,"INT219002400",4390,"INT229002400",5825,"INT339002400",8429]
[2550,51,"INT116002550",2530,"INT216002550",3440,"INT226002550",4672,"INT336002550",6773,"INT117502550",3027,"INT217502550",4067,"INT227502550",5483,"INT337502550",7953,"INT119002550",3488,"INT219002550",4664,"INT229002550",6189,"INT339002550",8956]
[2700,54,"INT116002700",2678,"INT216002700",3642,"INT226002700",4946,"INT336002700",7171,"INT117502700",3205,"INT217502700",4307,"INT227502700",5805,"INT337502700",8421,"INT119002700",3694,"INT219002700",4938,"INT229002700",6553,"INT339002700",9482]
[3000,60,"INT116003000",2976,"INT216003000",4047,"INT226003000",5496,"INT336003000",7968,"INT117503000",3561,"INT217503000",4785,"INT227503000",6450,"INT337503000",9357,"INT119003000",4104,"INT219003000",5487,"INT229003000",7281,"INT339003000",10536]
[]
[]
[]
["Tableau de référence"]
[]
["PENTE :",null,1.3498000000000001,null,1.3668,null,1.3845000000000001,null,1.3768,null,1.3451,null,1.3620000000000001,null,1.3756999999999999,null,1.3651,null,1.3404,null,1.3572,null,1.3669,null,1.3532999999999999]
["Hauteur",null,300,null,null,null,null,null,null,null,400,null,null,null,null,null,null,null,500]
["Type",null,"INT11",null,"INT21",null,"INT22",null,"INT33",null,"INT11",null,"INT21",null,"INT22",null,"INT33",null,"INT11",null,"INT21",null,"INT22",null,"INT33"]
["Longueur (mm)","Nombre éléments","Modèle","Watt \nDt 50°C","Modèle","Watt \nDt 50°C","Modèle","Watt \nDt 50°C","Modèle","Watt \nDt 50°C","Modèle","Watt \nDt 50°C","Modèle","Watt \nDt 50°C","Modèle","Watt \nDt 50°C","Modèle","Watt \nDt 50°C","Modèle","Watt \nDt 50°C","Modèle","Watt \nDt 50°C","Modèle","Watt \nDt 50°C","Modèle","Watt \nDt 50°C"]
[450,{"$f":"A62/50","v":9},{"$f":"IF(D62=\"\",\" - \",IF(LEN($A62)=3,C$60&$C$59&\"0\"&$A62,C$60&$C$59&$A62))","v":"INT113000450"},248,{"$f":"IF(F62=\"\",\" - \",IF(LEN($A62)=3,E$60&$C$59&\"0\"&$A62,E$60&$C$59&$A62))","v":"INT213000450"},361,{"$f":"IF(H62=\"\",\" - \",IF(LEN($A62)=3,G$60&$C$59&\"0\"&$A62,G$60&$C$59&$A62))","v":"INT223000450"},474,{"$f":"IF(J62=\"\",\" - \",IF(LEN($A62)=3,I$60&$C$59&\"0\"&$A62,I$60&$C$59&$A62))","v":"INT333000450"},672,{"$f":"IF(L62=\"\",\" - \",IF(LEN($A62)=3,K$60&$K$59&\"0\"&$A62,K$60&$K$59&$A62))","v":"INT114000450"},318,{"$f":"IF(N62=\"\",\" - \",IF(LEN($A62)=3,M$60&$K$59&\"0\"&$A62,M$60&$K$59&$A62))","v":"INT214000450"},448,{"$f":"IF(P62=\"\",\" - \",IF(LEN($A62)=3,O$60&$K$59&\"0\"&$A62,O$60&$K$59&$A62))","v":"INT224000450"},601,{"$f":"IF(R62=\"\",\" - \",IF(LEN($A62)=3,Q$60&$K$59&\"0\"&$A62,Q$60&$K$59&$A62))","v":"INT334000450"},863,{"$f":"IF(T62=\"\",\" - \",IF(LEN($A62)=3,S$60&$S$59&\"0\"&$A62,S$60&$S$59&$A62))","v":"INT115000450"},384,{"$f":"IF(V62=\"\",\" - \",IF(LEN($A62)=3,U$60&$S$59&\"0\"&$A62,U$60&$S$59&$A62))","v":"INT215000450"},530,{"$f":"IF(X62=\"\",\" - \",IF(LEN($A62)=3,W$60&$S$59&\"0\"&$A62,W$60&$S$59&$A62))","v":"INT225000450"},718,{"$f":"IF(Z62=\"\",\" - \",IF(LEN($A62)=3,Y$60&$S$59&\"0\"&$A62,Y$60&$S$59&$A62))","v":"INT335000450"},1037]
[600,{"$f":"A63/50","v":12},"INT113000600",331,"INT213000600",481,"INT223000600",632,"INT333000600",896,"INT114000600",424,"INT214000600",598,"INT224000600",802,"INT334000600",1151,"INT115000600",512,"INT215000600",706,"INT225000600",957,"INT335000600",1383]
[750,15,"INT113000750",413,"INT213000750",602,"INT223000750",790,"INT333000750",1121,"INT114000750",530,"INT214000750",747,"INT224000750",1002,"INT334000750",1439,"INT115000750",640,"INT215000750",883,"INT225000750",1196,"INT335000750",1729]
[900,18,"INT113000900",496,"INT213000900",722,"INT223000900",948,"INT333000900",1345,"INT114000900",635,"INT214000900",896,"INT224000900",1202,"INT334000900",1726,"INT115000900",768,"INT215000900",1059,"INT225000900",1436,"INT335000900",2075]
[1050,21,"INT113001050",579,"INT213001050",842,"INT223001050",1106,"INT333001050",1569,"INT114001050",741,"INT214001050",1046,"INT224001050",1403,"INT334001050",2014,"INT115001050",896,"INT215001050",1236,"INT225001050",1675,"INT335001050",2420]
[1200,24,"INT113001200",661,"INT213001200",962,"INT223001200",1264,"INT333001200",1793,"INT114001200",847,"INT214001200",1195,"INT224001200",1603,"INT334001200",2302,"INT115001200",1024,"INT215001200",1412,"INT225001200",1914,"INT335001200",2766]
[1350,27,"INT113001350",744,"INT213001350",1083,"INT223001350",1422,"INT333001350",2017,"INT114001350",953,"INT214001350",1345,"INT224001350",1804,"INT334001350",2589,"INT115001350",1152,"INT215001350",1589,"INT225001350",2153,"INT335001350",3112]
[1500,30,"INT113001500",827,"INT213001500",1203,"INT223001500",1580,"INT333001500",2241,"INT114001500",1059,"INT214001500",1494,"INT224001500",2004,"INT334001500",2877,"INT115001500",1280,"INT215001500",1766,"INT225001500",2393,"INT335001500",3458]
[1650,33,"INT113001650",909,"INT213001650",1323,"INT223001650",1737,"INT333001650",2465,"INT114001650",1165,"INT214001650",1643,"INT224001650",2204,"INT334001650",3165,"INT115001650",1407,"INT215001650",1942,"INT225001650",2632,"INT335001650",3803]
[1800,36,"INT113001800",992,"INT213001800",1444,"INT223001800",1895,"INT333001800",2689,"INT114001800",1271,"INT214001800",1793,"INT224001800",2405,"INT334001800",3452,"INT115001800",1535,"INT215001800",2119,"INT225001800",2871,"INT335001800",4149]
[1950,39,"INT113001950",1074,"INT213001950",1564,"INT223001950",2053,"INT333001950",2913,"INT114001950",1377,"INT214001950",1942,"INT224001950",2605,"INT334001950",3740,"INT115001950",1663,"INT215001950",2295,"INT225001950",3110,"INT335001950",4495]
[2100,42,"INT113002100",1157,"INT213002100",1684,"INT223002100",2211,"INT333002100",3137,"INT114002100",1483,"INT214002100",2092,"INT224002100",2806,"INT334002100",4028,"INT115002100",1791,"INT215002100",2472,"INT225002100",3350,"INT335002100",4841]
[2250,45,"INT113002250",1240,"INT213002250",1805,"INT223002250",2369,"INT333002250",3362,"INT114002250",1589,"INT214002250",2241,"INT224002250",3006,"INT334002250",4316,"INT115002250",1919,"INT215002250",2648,"INT225002250",3589,"INT335002250",5186]
[2400,48,"INT113002400",1322,"INT213002400",1925,"INT223002400",2527,"INT333002400",3586,"INT114002400",1694,"INT214002400",2390,"INT224002400",3206,"INT334002400",4603,"INT115002400",2047,"INT215002400",2825,"INT225002400",3828,"INT335002400",5532]
[2550,51,"INT113002550",1405,"INT213002550",2045,"INT223002550",2685,"INT333002550",3810,"INT114002550",1800,"INT214002550",2540,"INT224002550",3407,"INT334002550",4891,"INT115002550",2175,"INT215002550",3001,"INT225002550",4067,"INT335002550",5878]
[2700,54,"INT113002700",1488,"INT213002700",2165,"INT223002700",2843,"INT333002700",4034,"INT114002700",1906,"INT214002700",2689,"INT224002700",3607,"INT334002700",5179,"INT115002700",2303,"INT215002700",3178,"INT225002700",4307,"INT335002700",6224]
[3000,60,"INT113003000",1653,"INT213003000",2406,"INT223003000",3159,"INT333003000",4482,"INT114003000",2118,"INT214003000",2988,"INT224003000",4008,"INT334003000",5754,"INT115003000",2559,"INT215003000",3531,"INT225003000",4785,"INT335003000",6915]
[]
["PENTE :",null,1.3357000000000001,null,1.3523000000000001,null,1.3581000000000001,null,1.3414999999999999,null,1.3287,null,1.3451,null,1.3449,null,1.3238000000000001,null,1.3217000000000001,null,1.3379000000000001,null,1.3315999999999999,null,1.3061]
["Hauteur",null,600,null,null,null,null,null,null,null,750,null,null,null,null,null,null,null,900]
["Type",null,"INT11",null,"INT21",null,"INT22",null,"INT33",null,"INT11",null,"INT21",null,"INT22",null,"INT33",null,"INT11",null,"INT21",null,"INT22",null,"INT33"]
["Longueur (mm)","Nombre éléments","Modèle","Watt \nDt 50°C","Modèle","Watt \nDt 50°C","Modèle","Watt \nDt 50°C","Modèle","Watt \nDt 50°C","Modèle","Watt \nDt 50°C","Modèle","Watt \nDt 50°C","Modèle","Watt \nDt 50°C","Modèle","Watt \nDt 50°C","Modèle","Watt \nDt 50°C","Modèle","Watt \nDt 50°C","Modèle","Watt \nDt 50°C","Modèle","Watt \nDt 50°C"]
[450,{"$f":"A84/50","v":9},{"$f":"IF(D84=\"\",\" - \",IF(LEN($A84)=3,C$82&$C$81&\"0\"&$A84,C$82&$C$81&$A84))","v":"INT116000450"},446,{"$f":"IF(F84=\"\",\" - \",IF(LEN($A84)=3,E$82&$C$81&\"0\"&$A84,E$82&$C$81&$A84))","v":"INT216000450"},607,{"$f":"IF(H84=\"\",\" - \",IF(LEN($A84)=3,G$82&$C$81&\"0\"&$A84,G$82&$C$81&$A84))","v":"INT226000450"},824,{"$f":"IF(J84=\"\",\" - \",IF(LEN($A84)=3,I$82&$C$81&\"0\"&$A84,I$82&$C$81&$A84))","v":"INT336000450"},1195,{"$f":"IF(L84=\"\",\" - \",IF(LEN($A84)=3,K$82&$K$81&\"0\"&$A84,K$82&$K$81&$A84))","v":"INT117500450"},534,{"$f":"IF(N84=\"\",\" - \",IF(LEN($A84)=3,M$82&$K$81&\"0\"&$A84,M$82&$K$81&$A84))","v":"INT217500450"},718,{"$f":"IF(P84=\"\",\" - \",IF(LEN($A84)=3,O$82&$K$81&\"0\"&$A84,O$82&$K$81&$A84))","v":"INT227500450"},968,{"$f":"IF(R84=\"\",\" - \",IF(LEN($A84)=3,Q$82&$K$81&\"0\"&$A84,Q$82&$K$81&$A84))","v":"INT337500450"},1404,{"$f":"IF(T84=\"\",\" - \",IF(LEN($A84)=3,S$82&$S$81&\"0\"&$A84,S$82&$S$81&$A84))","v":"INT119000450"},616,{"$f":"IF(V84=\"\",\" - \",IF(LEN($A84)=3,U$82&$S$81&\"0\"&$A84,U$82&$S$81&$A84))","v":"INT219000450"},823,{"$f":"IF(X84=\"\",\" - \",IF(LEN($A84)=3,W$82&$S$81&\"0\"&$A84,W$82&$S$81&$A84))","v":"INT229000450"},1092,{"$f":"IF(Z84=\"\",\" - \",IF(LEN($A84)=3,Y$82&$S$81&\"0\"&$A84,Y$82&$S$81&$A84))","v":"INT339000450"},1580]
[600,{"$f":"A85/50","v":12},"INT116000600",595,"INT216000600",809,"INT226000600",1099,"INT336000600",1594,"INT117500600",712,"INT217500600",957,"INT227500600",1290,"INT337500600",1871,"INT119000600",821,"INT219000600",1097,"INT229000600",1456,"INT339000600",2107]
[750,15,"INT116000750",744,"INT216000750",1012,"INT226000750",1374,"INT336000750",1992,"INT117500750",890,"INT217500750",1196,"INT227500750",1613,"INT337500750",2339,"INT119000750",1026,"INT219000750",1372,"INT229000750",1820,"INT339000750",2634]
[900,18,"INT116000900",893,"INT216000900",1214,"INT226000900",1649,"INT336000900",2390,"INT117500900",1068,"INT217500900",1436,"INT227500900",1935,"INT337500900",2807,"INT119000900",1231,"INT219000900",1646,"INT229000900",2184,"INT339000900",3161]
[1050,21,"INT116001050",1042,"INT216001050",1416,"INT226001050",1924,"INT336001050",2789,"INT117501050",1246,"INT217501050",1675,"INT227501050",2258,"INT337501050",3275,"INT119001050",1436,"INT219001050",1920,"INT229001050",2548,"INT339001050",3688]
[1200,24,"INT116001200",1190,"INT216001200",1619,"INT226001200",2198,"INT336001200",3187,"INT117501200",1424,"INT217501200",1914,"INT227501200",2580,"INT337501200",3743,"INT119001200",1642,"INT219001200",2195,"INT229001200",2912,"INT339001200",4214]
[1350,27,"INT116001350",1339,"INT216001350",1821,"INT226001350",2473,"INT336001350",3586,"INT117501350",1602,"INT217501350",2153,"INT227501350",2903,"INT337501350",4211,"INT119001350",1847,"INT219001350",2469,"INT229001350",3276,"INT339001350",4741]
[1500,30,"INT116001500",1488,"INT216001500",2024,"INT226001500",2748,"INT336001500",3984,"INT117501500",1781,"INT217501500",2393,"INT227501500",3225,"INT337501500",4679,"INT119001500",2052,"INT219001500",2744,"INT229001500",3641,"INT339001500",5268]
[1650,33,"INT116001650",1637,"INT216001650",2226,"INT226001650",3023,"INT336001650",4382,"INT117501650",1959,"INT217501650",2632,"INT227501650",3548,"INT337501650",5146,"INT119001650",2257,"INT219001650",3018,"INT229001650",4005,"INT339001650",5795]
[1800,36,"INT116001800",1786,"INT216001800",2428,"INT226001800",3298,"INT336001800",4781,"INT117501800",2137,"INT217501800",2871,"INT227501800",3870,"INT337501800",5614,"INT119001800",2462,"INT219001800",3292,"INT229001800",4369,"INT339001800",6322]
[1950,39,"INT116001950",1934,"INT216001950",2631,"INT226001950",3572,"INT336001950",5179,"INT117501950",2315,"INT217501950",3110,"INT227501950",4193,"INT337501950",6082,"INT119001950",2668,"INT219001950",3567,"INT229001950",4733,"INT339001950",6848]
[2100,42,"INT116002100",2083,"INT216002100",2833,"INT226002100",3847,"INT336002100",5578,"INT117502100",2493,"INT217502100",3350,"INT227502100",4515,"INT337502100",6550,"INT119002100",2873,"INT219002100",3841,"INT229002100",5097,"INT339002100",7375]
[2250,45,"INT116002250",2232,"INT216002250",3035,"INT226002250",4122,"INT336002250",5976,"INT117502250",2671,"INT217502250",3589,"INT227502250",4838,"INT337502250",7018,"INT119002250",3078,"INT219002250",4115,"INT229002250",5461,"INT339002250",7902]
[2400,48,"INT116002400",2381,"INT216002400",3238,"INT226002400",4397,"INT336002400",6374,"INT117502400",2849,"INT217502400",3828,"INT227502400",5160,"INT337502400",7486,"INT119002400",3283,"INT219002400",4390,"INT229002400",5825,"INT339002400",8429]
[2550,51,"INT116002550",2530,"INT216002550",3440,"INT226002550",4672,"INT336002550",6773,"INT117502550",3027,"INT217502550",4067,"INT227502550",5483,"INT337502550",7953,"INT119002550",3488,"INT219002550",4664,"INT229002550",6189,"INT339002550",8956]
[2700,54,"INT116002700",2678,"INT216002700",3642,"INT226002700",4946,"INT336002700",7171,"INT117502700",3205,"INT217502700",4307,"INT227502700",5805,"INT337502700",8421,"INT119002700",3694,"INT219002700",4938,"INT229002700",6553,"INT339002700",9482]
[3000,60,"INT116003000",2976,"INT216003000",4047,"INT226003000",5496,"INT336003000",7968,"INT117503000",3561,"INT217503000",4785,"INT227503000",6450,"INT337503000",9357,"INT119003000",4104,"INT219003000",5487,"INT229003000",7281,"INT339003000",10536]

{"sheet":"INTEGRA MATERNELLE","index":7,"n_rows":56,"n_cols":22,"rows_kept":56,"cut":false,"hidden":false,"merged":[[37,4,37,5],[37,6,37,7],[36,0,36,1],[36,2,36,3],[36,4,36,5],[36,6,36,7],[37,0,37,1],[37,2,37,3],[2,2,2,6],[3,2,3,6],[4,2,4,6],[35,6,35,7],[35,0,35,1],[35,2,35,3],[35,4,35,5],[11,6,11,7],[10,6,10,7],[11,0,11,1],[11,2,11,3],[11,4,11,5],[10,0,10,1],[10,2,10,3],[10,4,10,5]]}
["Programme de calcul de la puissance thermique: INTEGRA MATERNELLE"]
[]
["Te",75,"<= Entrez la température à l'entrée en C°"]
["Ts",65,"<= Entrez la température à la sortie en C°"]
["Ti",20,"<= Entrez la température ambiante en C°"]
["Rapport",{"$f":"(B4-B5)/(B3-B5)","v":0.81818181818181823}]
["Delta T",{"$f":"((B3+B4)/2)-B5","v":50}]
["Delta T2",{"$f":"(B3-B4)/LN((B3-B5)/(B4-B5))","v":49.83288654563971},"Si Rapport < 0,7"]
[]
[]
["Hauteur",null,{"$f":"C37","v":400},null,{"$f":"E37","v":600},null,{"$f":"G37","v":750}]
["Type",null,{"$f":"C38","v":"INT32"},null,{"$f":"E38","v":"INT32"},null,{"$f":"G38","v":"INT32"}]
["Longueur (mm)","Nombre éléments","Modèle","Puissance (watts)     ","Modèle","Puissance (watts)     ","Modèle","Puissance (watts)     "]
[{"$f":"A40","v":450},{"$f":"B40","v":9},{"$f":"C40","v":"INT324000450"},{"$f":"IF(D40=\"\",\" - \",IF($B$6<0.7,D40*POWER($B$8/50,C$36),D40*POWER($B$7/50,C$36)))","v":605},{"$f":"E40","v":"INT326000450"},{"$f":"IF(F40=\"\",\" - \",IF($B$6<0.7,F40*POWER($B$8/50,E$36),F40*POWER($B$7/50,E$36)))","v":810},{"$f":"G40","v":"INT327500450"},{"$f":"IF(H40=\"\",\" - \",IF($B$6<0.7,H40*POWER($B$8/50,G$36),H40*POWER($B$7/50,G$36)))","v":954},null,null,null,null,null,null,null,null,null,null,null,null,null,","]
[{"$f":"A41","v":600},12,"INT324000600",{"$f":"IF(D41=\"\",\" - \",IF($B$6<0.7,D41*POWER($B$8/50,C$36),D41*POWER($B$7/50,C$36)))","v":806},{"$f":"E41","v":"INT326000600"},{"$f":"IF(F41=\"\",\" - \",IF($B$6<0.7,F41*POWER($B$8/50,E$36),F41*POWER($B$7/50,E$36)))","v":1080},{"$f":"G41","v":"INT327500600"},{"$f":"IF(H41=\"\",\" - \",IF($B$6<0.7,H41*POWER($B$8/50,G$36),H41*POWER($B$7/50,G$36)))","v":1272}]
[750,15,"INT324000750",941,"INT326000750",1260,"INT327500750",1484]
[900,18,"INT324000900",1075,"INT326000900",1440,"INT327500900",1696]
[1050,21,"INT324001050",1210,"INT326001050",1620,"INT327501050",1908]
[1200,24,"INT324001200",1344,"INT326001200",1800,"INT327501200",2120]
[1350,27,"INT324001350",1478,"INT326001350",1980,"INT327501350",2332]
[1500,30,"INT324001500",1613,"INT326001500",2160,"INT327501500",2544]
[1650,33,"INT324001650",1814,"INT326001650",2430,"INT327501650",2862]
[1800,36,"INT324001800",2016,"INT326001800",2700,"INT327501800",3180]
[1950,39,"INT324001950",2218,"INT326001950",2970,"INT327501950",3498]
[2100,42,"INT324002100",2419,"INT326002100",3240,"INT327502100",3816]
[2250,45,"INT324002250",2621,"INT326002250",3510,"INT327502250",4134]
[2400,48,"INT324002400",2822,"INT326002400",3780,"INT327502400",4452]
[2550,51,"INT324002550",3024,"INT326002550",4050,"INT327502550",4770]
[2700,54," - "," - "," - "," - "," - "," - "]
[3000,60," - "," - "," - "," - "," - "," - "]
[]
[]
[]
["Tableau de référence"]
[]
["PENTE :",null,1.371,null,1.37,null,1.369]
["Hauteur",null,400,null,600,null,750]
["Type",null,"INT32",null,"INT32",null,"INT32"]
["Longueur (mm)","Nombre éléments","Modèle","Watt \nDt 50°C","Modèle","Watt \nDt 50°C","Modèle","Watt \nDt 50°C"]
[450,{"$f":"A40/50","v":9},{"$f":"IF(D40=\"\",\" - \",IF(LEN($A40)=3,C$38&$C$37&\"0\"&$A40,C$38&$C$37&$A40))","v":"INT324000450"},605,{"$f":"IF(F40=\"\",\" - \",IF(LEN($A40)=3,E$38&$E$37&\"0\"&$A40,E$38&$E$37&$A40))","v":"INT326000450"},810,{"$f":"IF(H40=\"\",\" - \",IF(LEN($A40)=3,G$38&$G$37&\"0\"&$A40,G$38&$G$37&$A40))","v":"INT327500450"},954]
[600,{"$f":"A41/50","v":12},"INT324000600",806,"INT326000600",1080,"INT327500600",1272]
[750,15,"INT324000750",941,"INT326000750",1260,"INT327500750",1484]
[900,18,"INT324000900",1075,"INT326000900",1440,"INT327500900",1696]
[1050,21,"INT324001050",1210,"INT326001050",1620,"INT327501050",1908]
[1200,24,"INT324001200",1344,"INT326001200",1800,"INT327501200",2120]
[1350,27,"INT324001350",1478,"INT326001350",1980,"INT327501350",2332]
[1500,30,"INT324001500",1613,"INT326001500",2160,"INT327501500",2544]
[1650,33,"INT324001650",1814,"INT326001650",2430,"INT327501650",2862]
[1800,36,"INT324001800",2016,"INT326001800",2700,"INT327501800",3180]
[1950,39,"INT324001950",2218,"INT326001950",2970,"INT327501950",3498]
[2100,42,"INT324002100",2419,"INT326002100",3240,"INT327502100",3816]
[2250,45,"INT324002250",2621,"INT326002250",3510,"INT327502250",4134]
[2400,48,"INT324002400",2822,"INT326002400",3780,"INT327502400",4452]
[2550,51,"INT324002550",3024,"INT326002550",4050,"INT327502550",4770]
[2700,54," - ",null," - ",null," - "]
[3000,60," - ",null," - ",null," - "]

{"sheet":"INTEGRA PLINTHE","index":8,"n_rows":50,"n_cols":22,"rows_kept":50,"cut":false,"hidden":false,"merged":[[10,0,10,1],[10,2,10,7],[2,2,2,6],[3,2,3,6],[4,2,4,6],[32,0,32,1],[32,2,32,3],[32,4,32,5],[32,6,32,7],[11,0,11,1],[11,2,11,3],[11,4,11,5],[11,6,11,7],[33,0,33,1],[33,2,33,7],[34,0,34,1],[34,2,34,3],[34,4,34,5],[34,6,34,7]]}
["Programme de calcul de la puissance thermique: INTEGRA PLINTHE"]
[]
["Te",75,"<= Entrez la température à l'entrée en C°"]
["Ts",65,"<= Entrez la température à la sortie en C°"]
["Ti",20,"<= Entrez la température ambiante en C°"]
["Rapport",{"$f":"(B4-B5)/(B3-B5)","v":0.81818181818181823}]
["Delta T",{"$f":"((B3+B4)/2)-B5","v":50}]
["Delta T2",{"$f":"(B3-B4)/LN((B3-B5)/(B4-B5))","v":49.83288654563971},"Si Rapport < 0,7"]
[]
[]
["Hauteur",null,{"$f":"C34","v":200}]
["Type",null,{"$f":"C35","v":"CV22"},null,{"$f":"E35","v":"CV33"},null,{"$f":"G35","v":"CV44"}]
["Longueur (mm)","Nombre éléments","Modèle","Puissance (watts)     ","Modèle","Puissance (watts)     ","Modèle","Puissance (watts)     "]
[{"$f":"A37","v":600},{"$f":"B37","v":12},{"$f":"C37","v":"CV222000600"},{"$f":"IF(D37=\"\",\" - \",IF($B$6<0.7,D37*POWER($B$8/50,C$33),D37*POWER($B$7/50,C$33)))","v":434},{"$f":"E37","v":"CV332000600"},{"$f":"IF(F37=\"\",\" - \",IF($B$6<0.7,F37*POWER($B$8/50,E$33),F37*POWER($B$7/50,E$33)))","v":613},{"$f":"G37","v":"CV442000600"},{"$f":"IF(H37=\"\",\" - \",IF($B$6<0.7,H37*POWER($B$8/50,G$33),H37*POWER($B$7/50,G$33)))","v":802},null,null,null,null,null,null,null,null,null,null,null,null,null,","]
[{"$f":"A38","v":700},14,"CV222000700",507,{"$f":"E38","v":"CV332000700"},715,{"$f":"G38","v":"CV442000700"},936]
[800,16,"CV222000800",579,"CV332000800",818,"CV442000800",1070]
[900,18,"CV222000900",652,"CV332000900",920,"CV442000900",1203]
[1000,20,"CV222001000",724,"CV332001000",1022,"CV442001000",1337]
[1100,22,"CV222001100",796,"CV332001100",1124,"CV442001100",1471]
[1200,24,"CV222001200",869,"CV332001200",1226,"CV442001200",1604]
[1400,28,"CV222001400",1014,"CV332001400",1431,"CV442001400",1872]
[1600,32,"CV222001600",1158,"CV332001600",1635,"CV442001600",2139]
[1800,36,"CV222001800",1303,"CV332001800",1840,"CV442001800",2407]
[2000,40,"CV222002000",1448,"CV332002000",2044,"CV442002000",2674]
[2300,46,"CV222002300",1665,"CV332002300",2351,"CV442002300",3075]
[2600,52,"CV222002600",1882,"CV332002600",2657,"CV442002600",3476]
[3000,60,"CV222003000",2172,"CV332003000",3066,"CV442003000",4011]
[]
[]
[]
["Tableau de référence"]
[]
["PENTE :",null,1.3269,null,1.3403,null,1.3515999999999999]
["Hauteur",null,200]
["Type",null,"CV22",null,"CV33",null,"CV44"]
["Longueur (mm)","Nombre éléments","Modèle","Watt \nDt 50°C","Modèle","Watt \nDt 50°C","Modèle","Watt \nDt 50°C"]
[600,{"$f":"A37/50","v":12},{"$f":"IF(D37=\"\",\" - \",IF(LEN($A37)=3,C$35&$C$34&\"0\"&$A37,C$35&$C$34&$A37))","v":"CV222000600"},434,{"$f":"IF(F37=\"\",\" - \",IF(LEN($A37)=3,E$35&$C$34&\"0\"&$A37,E$35&$C$34&$A37))","v":"CV332000600"},613,{"$f":"IF(H37=\"\",\" - \",IF(LEN($A37)=3,G$35&$C$34&\"0\"&$A37,G$35&$C$34&$A37))","v":"CV442000600"},802]
[700,{"$f":"A38/50","v":14},"CV222000700",507,"CV332000700",715,"CV442000700",936]
[800,16,"CV222000800",579,"CV332000800",818,"CV442000800",1070]
[900,18,"CV222000900",652,"CV332000900",920,"CV442000900",1203]
[1000,20,"CV222001000",724,"CV332001000",1022,"CV442001000",1337]
[1100,22,"CV222001100",796,"CV332001100",1124,"CV442001100",1471]
[1200,24,"CV222001200",869,"CV332001200",1226,"CV442001200",1604]
[1400,28,"CV222001400",1014,"CV332001400",1431,"CV442001400",1872]
[1600,32,"CV222001600",1158,"CV332001600",1635,"CV442001600",2139]
[1800,36,"CV222001800",1303,"CV332001800",1840,"CV442001800",2407]
[2000,40,"CV222002000",1448,"CV332002000",2044,"CV442002000",2674]
[2300,46,"CV222002300",1665,"CV332002300",2351,"CV442002300",3075]
[2600,52,"CV222002600",1882,"CV332002600",2657,"CV442002600",3476]
[3000,60,"CV222003000",2172,"CV332003000",3066,"CV442003000",4011]

{"sheet":"PARADA","index":9,"n_rows":100,"n_cols":44,"rows_kept":100,"cut":false,"hidden":false,"merged":[[10,0,10,1],[10,2,10,9],[2,2,2,6],[3,2,3,6],[4,2,4,6],[32,0,32,1],[32,2,32,9],[32,10,32,17],[32,18,32,25],[10,18,10,25],[11,0,11,1],[11,2,11,3],[11,4,11,5],[11,6,11,7],[11,8,11,9],[11,10,11,11],[11,12,11,13],[11,14,11,15],[11,16,11,17],[10,10,10,17],[11,18,11,19],[11,20,11,21],[11,22,11,23],[11,24,11,25],[33,24,33,25],[33,18,33,19],[33,20,33,21],[33,22,33,23],[33,12,33,13],[33,14,33,15],[33,16,33,17],[57,0,57,1],[57,2,57,3],[57,4,57,5],[57,6,57,7],[57,8,57,9],[33,0,33,1],[33,2,33,3],[33,4,33,5],[33,6,33,7],[33,8,33,9],[33,10,33,11],[57,18,57,19],[57,20,57,21],[57,22,57,23],[57,24,57,25],[58,0,58,1],[58,2,58,9],[58,10,58,17],[58,18,58,25],[57,10,57,11],[57,12,57,13],[57,14,57,15],[57,16,57,17],[59,16,59,17],[59,18,59,19],[59,20,59,21],[59,22,59,23],[59,0,59,1],[59,2,59,3],[59,4,59,5],[59,6,59,7],[59,8,59,9],[59,10,59,11],[80,0,80,1],[80,2,80,9],[80,10,80,17],[80,18,80,25],[59,24,59,25],[79,0,79,1],[79,2,79,3],[79,4,79,5],[79,6,79,7],[79,8,79,9],[79,10,79,11],[79,12,79,13],[79,14,79,15],[79,16,79,17],[59,12,59,13],[59,14,59,15],[81,10,81,11],[79,18,79,19],[79,20,79,21],[79,22,79,23],[79,24,79,25],[81,24,81,25],[81,12,81,13],[81,14,81,15],[81,16,81,17],[81,18,81,19],[81,20,81,21],[81,22,81,23],[81,0,81,1],[81,2,81,3],[81,4,81,5],[81,6,81,7],[81,8,81,9]]}
["Programme de calcul de la puissance thermique: PARADA"]
[]
["Te",75,"<= Entrez la température à l'entrée en C°"]
["Ts",65,"<= Entrez la température à la sortie en C°"]
["Ti",20,"<= Entrez la température ambiante en C°"]
["Rapport",{"$f":"(B4-B5)/(B3-B5)","v":0.81818181818181823}]
["Delta T",{"$f":"((B3+B4)/2)-B5","v":50}]
["Delta T2",{"$f":"(B3-B4)/LN((B3-B5)/(B4-B5))","v":49.83288654563971},"Si Rapport < 0,7"]
[]
[]
["Hauteur",null,{"$f":"C59","v":300},null,null,null,null,null,null,null,{"$f":"K59","v":400},null,null,null,null,null,null,null,{"$f":"S59","v":500}]
["Type",null,{"$f":"C60","v":"PAR11"},null,{"$f":"E60","v":"PAR21"},null,{"$f":"G60","v":"PAR22"},null,{"$f":"I60","v":"PAR33"},null,{"$f":"K60","v":"PAR11"},null,{"$f":"M60","v":"PAR21"},null,{"$f":"O60","v":"PAR22"},null,{"$f":"Q60","v":"PAR33"},null,{"$f":"S60","v":"PAR11"},null,{"$f":"U60","v":"PAR21"},null,{"$f":"W60","v":"PAR22"},null,{"$f":"Y60","v":"PAR33"}]
["Longueur (mm)","Nombre éléments","Modèle","Puissance (watts)     ","Modèle","Puissance (watts)     ","Modèle","Puissance (watts)     ","Modèle","Puissance (watts)     ","Modèle","Puissance (watts)     ","Modèle","Puissance (watts)     ","Modèle","Puissance (watts)     ","Modèle","Puissance (watts)     ","Modèle","Puissance (watts)     ","Modèle","Puissance (watts)     ","Modèle","Puissance (watts)     ","Modèle","Puissance (watts)     "]
[{"$f":"A62","v":450},{"$f":"B62","v":9},{"$f":"C62","v":"PAR113000450"},{"$f":"IF(D62=\"\",\" - \",IF($B$6<0.7,D62*POWER($B$8/50,C$58),D62*POWER($B$7/50,C$58)))","v":242},{"$f":"E62","v":"PAR213000450"},{"$f":"IF(F62=\"\",\" - \",IF($B$6<0.7,F62*POWER($B$8/50,E$58),F62*POWER($B$7/50,E$58)))","v":339},{"$f":"G62","v":"PAR223000450"},{"$f":"IF(H62=\"\",\" - \",IF($B$6<0.7,H62*POWER($B$8/50,G$58),H62*POWER($B$7/50,G$58)))","v":456},{"$f":"I62","v":"PAR333000450"},{"$f":"IF(J62=\"\",\" - \",IF($B$6<0.7,J62*POWER($B$8/50,I$58),J62*POWER($B$7/50,I$58)))","v":638},{"$f":"K62","v":"PAR114000450"},{"$f":"IF(L62=\"\",\" - \",IF($B$6<0.7,L62*POWER($B$8/50,K$58),L62*POWER($B$7/50,K$58)))","v":306},{"$f":"M62","v":"PAR214000450"},{"$f":"IF(N62=\"\",\" - \",IF($B$6<0.7,N62*POWER($B$8/50,M$58),N62*POWER($B$7/50,M$58)))","v":421},{"$f":"O62","v":"PAR224000450"},{"$f":"IF(P62=\"\",\" - \",IF($B$6<0.7,P62*POWER($B$8/50,O$58),P62*POWER($B$7/50,O$58)))","v":569},{"$f":"Q62","v":"PAR334000450"},{"$f":"IF(R62=\"\",\" - \",IF($B$6<0.7,R62*POWER($B$8/50,Q$58),R62*POWER($B$7/50,Q$58)))","v":809},{"$f":"S62","v":"PAR115000450"},{"$f":"IF(T62=\"\",\" - \",IF($B$6<0.7,T62*POWER($B$8/50,S$58),T62*POWER($B$7/50,S$58)))","v":366},{"$f":"U62","v":"PAR215000450"},{"$f":"IF(V62=\"\",\" - \",IF($B$6<0.7,V62*POWER($B$8/50,U$58),V62*POWER($B$7/50,U$58)))","v":498},{"$f":"W62","v":"PAR225000450"},{"$f":"IF(X62=\"\",\" - \",IF($B$6<0.7,X62*POWER($B$8/50,W$58),X62*POWER($B$7/50,W$58)))","v":675},{"$f":"Y62","v":"PAR335000450"},{"$f":"IF(Z62=\"\",\" - \",IF($B$6<0.7,Z62*POWER($B$8/50,Y$58),Z62*POWER($B$7/50,Y$58)))","v":970},null,null,null,null,null,null,null,null,null,null,null,null,null,","]
[{"$f":"A63","v":600},12,"PAR113000600",{"$f":"IF(D63=\"\",\" - \",IF($B$6<0.7,D63*POWER($B$8/50,C$58),D63*POWER($B$7/50,C$58)))","v":323},{"$f":"E63","v":"PAR213000600"},{"$f":"IF(F63=\"\",\" - \",IF($B$6<0.7,F63*POWER($B$8/50,E$58),F63*POWER($B$7/50,E$58)))","v":453},{"$f":"G63","v":"PAR223000600"},{"$f":"IF(H63=\"\",\" - \",IF($B$6<0.7,H63*POWER($B$8/50,G$58),H63*POWER($B$7/50,G$58)))","v":608},{"$f":"I63","v":"PAR333000600"},{"$f":"IF(J63=\"\",\" - \",IF($B$6<0.7,J63*POWER($B$8/50,I$58),J63*POWER($B$7/50,I$58)))","v":850},{"$f":"K63","v":"PAR114000600"},{"$f":"IF(L63=\"\",\" - \",IF($B$6<0.7,L63*POWER($B$8/50,K$58),L63*POWER($B$7/50,K$58)))","v":408},{"$f":"M63","v":"PAR214000600"},{"$f":"IF(N63=\"\",\" - \",IF($B$6<0.7,N63*POWER($B$8/50,M$58),N63*POWER($B$7/50,M$58)))","v":561},{"$f":"O63","v":"PAR224000600"},{"$f":"IF(P63=\"\",\" - \",IF($B$6<0.7,P63*POWER($B$8/50,O$58),P63*POWER($B$7/50,O$58)))","v":759},{"$f":"Q63","v":"PAR334000600"},{"$f":"IF(R63=\"\",\" - \",IF($B$6<0.7,R63*POWER($B$8/50,Q$58),R63*POWER($B$7/50,Q$58)))","v":1079},{"$f":"S63","v":"PAR115000600"},{"$f":"IF(T63=\"\",\" - \",IF($B$6<0.7,T63*POWER($B$8/50,S$58),T63*POWER($B$7/50,S$58)))","v":489},{"$f":"U63","v":"PAR215000600"},{"$f":"IF(V63=\"\",\" - \",IF($B$6<0.7,V63*POWER($B$8/50,U$58),V63*POWER($B$7/50,U$58)))","v":664},{"$f":"W63","v":"PAR225000600"},{"$f":"IF(X63=\"\",\" - \",IF($B$6<0.7,X63*POWER($B$8/50,W$58),X63*POWER($B$7/50,W$58)))","v":900},{"$f":"Y63","v":"PAR335000600"},{"$f":"IF(Z63=\"\",\" - \",IF($B$6<0.7,Z63*POWER($B$8/50,Y$58),Z63*POWER($B$7/50,Y$58)))","v":1293}]
[750,15,"PAR113000750",404,"PAR213000750",566,"PAR223000750",759,"PAR333000750",1063,"PAR114000750",510,"PAR214000750",702,"PAR224000750",949,"PAR334000750",1349,"PAR115000750",611,"PAR215000750",830,"PAR225000750",1124,"PAR335000750",1616]
[900,18,"PAR113000900",485,"PAR213000900",679,"PAR223000900",911,"PAR333000900",1275,"PAR114000900",612,"PAR214000900",842,"PAR224000900",1139,"PAR334000900",1619,"PAR115000900",733,"PAR215000900",996,"PAR225000900",1349,"PAR335000900",1939]
[1050,21,"PAR113001050",565,"PAR213001050",792,"PAR223001050",1063,"PAR333001050",1488,"PAR114001050",714,"PAR214001050",983,"PAR224001050",1328,"PAR334001050",1889,"PAR115001050",855,"PAR215001050",1162,"PAR225001050",1574,"PAR335001050",2262]
[1200,24,"PAR113001200",646,"PAR213001200",905,"PAR223001200",1215,"PAR333001200",1701,"PAR114001200",816,"PAR214001200",1123,"PAR224001200",1518,"PAR334001200",2158,"PAR115001200",977,"PAR215001200",1328,"PAR225001200",1799,"PAR335001200",2586]
[1350,27,"PAR113001350",727,"PAR213001350",1018,"PAR223001350",1367,"PAR333001350",1913,"PAR114001350",918,"PAR214001350",1263,"PAR224001350",1708,"PAR334001350",2428,"PAR115001350",1099,"PAR215001350",1494,"PAR225001350",2024,"PAR335001350",2909]
[1500,30,"PAR113001500",808,"PAR213001500",1132,"PAR223001500",1519,"PAR333001500",2126,"PAR114001500",1020,"PAR214001500",1404,"PAR224001500",1898,"PAR334001500",2698,"PAR115001500",1221,"PAR215001500",1660,"PAR225001500",2249,"PAR335001500",3232]
[1650,33,"PAR113001650",888,"PAR213001650",1245,"PAR223001650",1671,"PAR333001650",2338,"PAR114001650",1122,"PAR214001650",1544,"PAR224001650",2087,"PAR334001650",2968,"PAR115001650",1343,"PAR215001650",1826,"PAR225001650",2474,"PAR335001650",3555]
[1800,36," - "," - ","PAR213001800",1358,"PAR223001800",1823,"PAR333001800",2551," - "," - ","PAR214001800",1684,"PAR224001800",2277,"PAR334001800",3237," - "," - ","PAR215001800",1992,"PAR225001800",2699,"PAR335001800",3878]
[1950,39," - "," - ","PAR213001950",1471,"PAR223001950",1975,"PAR333001950",2764," - "," - ","PAR214001950",1825,"PAR224001950",2467,"PAR334001950",3507," - "," - ","PAR215001950",2158,"PAR225001950",2923,"PAR335001950",4201]
[2100,42," - "," - ","PAR213002100",1584,"PAR223002100",2126,"PAR333002100",2976," - "," - ","PAR214002100",1965,"PAR224002100",2657,"PAR334002100",3777," - "," - ","PAR215002100",2324,"PAR225002100",3148,"PAR335002100",4525]
[2250,45," - "," - ","PAR213002250",1697,"PAR223002250",2278,"PAR333002250",3189," - "," - ","PAR214002250",2106,"PAR224002250",2846,"PAR334002250",4047," - "," - ","PAR215002250",2490,"PAR225002250",3373,"PAR335002250",4848]
[2400,48," - "," - ","PAR213002400",1811,"PAR223002400",2430,"PAR333002400",3401," - "," - ","PAR214002400",2246,"PAR224002400",3036,"PAR334002400",4317," - "," - ","PAR215002400",2656,"PAR225002400",3598,"PAR335002400",5171]
[2550,51," - "," - ","PAR213002550",1924,"PAR223002550",2582,"PAR333002550",3614," - "," - ","PAR214002550",2386,"PAR224002550",3226,"PAR334002550",4586," - "," - ","PAR215002550",2822,"PAR225002550",3823,"PAR335002550",5494]
[2700,54," - "," - ","PAR213002700",2037,"PAR223002700",2734,"PAR333002700",3826," - "," - ","PAR214002700",2527,"PAR224002700",3416,"PAR334002700",4856," - "," - ","PAR215002700",2988,"PAR225002700",4048,"PAR335002700",5817]
[3000,60," - "," - ","PAR213003000",2263,"PAR223003000",3038,"PAR333003000",4252," - "," - ","PAR214003000",2807,"PAR224003000",3795,"PAR334003000",5396," - "," - ","PAR215003000",3320,"PAR225003000",4498,"PAR335003000",6464]
[]
[]
["Hauteur",null,{"$f":"C81","v":600},null,null,null,null,null,null,null,{"$f":"K81","v":750},null,null,null,null,null,null,null,{"$f":"S81","v":900}]
["Type",null,{"$f":"C82","v":"PAR11"},null,{"$f":"E82","v":"PAR21"},null,{"$f":"G82","v":"PAR22"},null,{"$f":"I82","v":"PAR33"},null,{"$f":"K82","v":"PAR11"},null,{"$f":"M82","v":"PAR21"},null,{"$f":"O82","v":"PAR22"},null,{"$f":"Q82","v":"PAR33"},null,{"$f":"S82","v":"PAR11"},null,{"$f":"U82","v":"PAR21"},null,{"$f":"W82","v":"PAR22"},null,{"$f":"Y82","v":"PAR33"}]
["Longueur (mm)","Nombre éléments","Modèle","Puissance (watts)     ","Modèle","Puissance (watts)     ","Modèle","Puissance (watts)     ","Modèle","Puissance (watts)     ","Modèle","Puissance (watts)     ","Modèle","Puissance (watts)     ","Modèle","Puissance (watts)     ","Modèle","Puissance (watts)     ","Modèle","Puissance (watts)     ","Modèle","Puissance (watts)     ","Modèle","Puissance (watts)     ","Modèle","Puissance (watts)     "]
[{"$f":"A84","v":450},{"$f":"B84","v":9},{"$f":"C84","v":"PAR116000450"},{"$f":"IF(D84=\"\",\" - \",IF($B$6<0.7,D84*POWER($B$8/50,C$80),D84*POWER($B$7/50,C$80)))","v":424},{"$f":"E84","v":"PAR216000450"},{"$f":"IF(F84=\"\",\" - \",IF($B$6<0.7,F84*POWER($B$8/50,E$80),F84*POWER($B$7/50,E$80)))","v":571},{"$f":"G84","v":"PAR226000450"},{"$f":"IF(H84=\"\",\" - \",IF($B$6<0.7,H84*POWER($B$8/50,G$80),H84*POWER($B$7/50,G$80)))","v":773},{"$f":"I84","v":"PAR336000450"},{"$f":"IF(J84=\"\",\" - \",IF($B$6<0.7,J84*POWER($B$8/50,I$80),J84*POWER($B$7/50,I$80)))","v":1120},{"$f":"K84","v":"PAR117500450"},{"$f":"IF(L84=\"\",\" - \",IF($B$6<0.7,L84*POWER($B$8/50,K$80),L84*POWER($B$7/50,K$80)))","v":506},{"$f":"M84","v":"PAR217500450"},{"$f":"IF(N84=\"\",\" - \",IF($B$6<0.7,N84*POWER($B$8/50,M$80),N84*POWER($B$7/50,M$80)))","v":676},{"$f":"O84","v":"PAR227500450"},{"$f":"IF(P84=\"\",\" - \",IF($B$6<0.7,P84*POWER($B$8/50,O$80),P84*POWER($B$7/50,O$80)))","v":911},{"$f":"Q84","v":"PAR337500450"},{"$f":"IF(R84=\"\",\" - \",IF($B$6<0.7,R84*POWER($B$8/50,Q$80),R84*POWER($B$7/50,Q$80)))","v":1329},{"$f":"S84","v":"PAR119000450"},{"$f":"IF(T84=\"\",\" - \",IF($B$6<0.7,T84*POWER($B$8/50,S$80),T84*POWER($B$7/50,S$80)))","v":584},{"$f":"U84","v":"PAR219000450"},{"$f":"IF(V84=\"\",\" - \",IF($B$6<0.7,V84*POWER($B$8/50,U$80),V84*POWER($B$7/50,U$80)))","v":776},{"$f":"W84","v":"PAR229000450"},{"$f":"IF(X84=\"\",\" - \",IF($B$6<0.7,X84*POWER($B$8/50,W$80),X84*POWER($B$7/50,W$80)))","v":1037},{"$f":"Y84","v":"PAR339000450"},{"$f":"IF(Z84=\"\",\" - \",IF($B$6<0.7,Z84*POWER($B$8/50,Y$80),Z84*POWER($B$7/50,Y$80)))","v":1521}]
[{"$f":"A85","v":600},12,"PAR116000600",{"$f":"IF(D85=\"\",\" - \",IF($B$6<0.7,D85*POWER($B$8/50,C$80),D85*POWER($B$7/50,C$80)))","v":565},"PAR216000600",{"$f":"IF(F85=\"\",\" - \",IF($B$6<0.7,F85*POWER($B$8/50,E$80),F85*POWER($B$7/50,E$80)))","v":762},"PAR226000600",{"$f":"IF(H85=\"\",\" - \",IF($B$6<0.7,H85*POWER($B$8/50,G$80),H85*POWER($B$7/50,G$80)))","v":1031},"PAR336000600",{"$f":"IF(J85=\"\",\" - \",IF($B$6<0.7,J85*POWER($B$8/50,I$80),J85*POWER($B$7/50,I$80)))","v":1493},"PAR117500600",{"$f":"IF(L85=\"\",\" - \",IF($B$6<0.7,L85*POWER($B$8/50,K$80),L85*POWER($B$7/50,K$80)))","v":675},"PAR217500600",{"$f":"IF(N85=\"\",\" - \",IF($B$6<0.7,N85*POWER($B$8/50,M$80),N85*POWER($B$7/50,M$80)))","v":901},"PAR227500600",{"$f":"IF(P85=\"\",\" - \",IF($B$6<0.7,P85*POWER($B$8/50,O$80),P85*POWER($B$7/50,O$80)))","v":1214},"PAR337500600",{"$f":"IF(R85=\"\",\" - \",IF($B$6<0.7,R85*POWER($B$8/50,Q$80),R85*POWER($B$7/50,Q$80)))","v":1772},"PAR119000600",{"$f":"IF(T85=\"\",\" - \",IF($B$6<0.7,T85*POWER($B$8/50,S$80),T85*POWER($B$7/50,S$80)))","v":779},"PAR219000600",{"$f":"IF(V85=\"\",\" - \",IF($B$6<0.7,V85*POWER($B$8/50,U$80),V85*POWER($B$7/50,U$80)))","v":1034},"PAR229000600",{"$f":"IF(X85=\"\",\" - \",IF($B$6<0.7,X85*POWER($B$8/50,W$80),X85*POWER($B$7/50,W$80)))","v":1383},"PAR339000600",{"$f":"IF(Z85=\"\",\" - \",IF($B$6<0.7,Z85*POWER($B$8/50,Y$80),Z85*POWER($B$7/50,Y$80)))","v":2028}]
[750,15,"PAR116000750",707,"PAR216000750",952,"PAR226000750",1289,"PAR336000750",1867,"PAR117500750",844,"PAR217500750",1127,"PAR227500750",1518,"PAR337500750",2215,"PAR119000750",974,"PAR219000750",1293,"PAR229000750",1729,"PAR339000750",2535]
[900,18,"PAR116000900",848,"PAR216000900",1142,"PAR226000900",1547,"PAR336000900",2240,"PAR117500900",1013,"PAR217500900",1352,"PAR227500900",1822,"PAR337500900",2658,"PAR119000900",1168,"PAR219000900",1552,"PAR229000900",2075,"PAR339000900",3041]
[1050,21,"PAR116001050",990,"PAR216001050",1333,"PAR226001050",1804,"PAR336001050",2613,"PAR117501050",1181,"PAR217501050",1577,"PAR227501050",2125,"PAR337501050",3101,"PAR119001050",1363,"PAR219001050",1810,"PAR229001050",2421,"PAR339001050",3548]
[1200,24,"PAR116001200",1131,"PAR216001200",1523,"PAR226001200",2062,"PAR336001200",2987,"PAR117501200",1350,"PAR217501200",1802,"PAR227501200",2429,"PAR337501200",3544,"PAR119001200",1558,"PAR219001200",2069,"PAR229001200",2766,"PAR339001200",4055]
[1350,27,"PAR116001350",1272,"PAR216001350",1713,"PAR226001350",2320,"PAR336001350",3360,"PAR117501350",1519,"PAR217501350",2028,"PAR227501350",2732,"PAR337501350",3987,"PAR119001350",1753,"PAR219001350",2327,"PAR229001350",3112,"PAR339001350",4562]
[1500,30,"PAR116001500",1414,"PAR216001500",1904,"PAR226001500",2578,"PAR336001500",3733,"PAR117501500",1688,"PAR217501500",2253,"PAR227501500",3036,"PAR337501500",4430,"PAR119001500",1947,"PAR219001500",2586,"PAR229001500",3458,"PAR339001500",5069]
[1650,33,"PAR116001650",1555,"PAR216001650",2094,"PAR226001650",2835,"PAR336001650",4107,"PAR117501650",1856,"PAR217501650",2478,"PAR227501650",3340,"PAR337501650",4873,"PAR119001650",2142,"PAR219001650",2845,"PAR229001650",3804,"PAR339001650",5576]
[1800,36," - "," - ","PAR216001800",2285,"PAR226001800",3093,"PAR336001800",4480," - "," - ","PAR217501800",2704,"PAR227501800",3643,"PAR337501800",5316," - "," - ","PAR219001800",3103,"PAR229001800",4150,"PAR339001800",6083]
[1950,39," - "," - ","PAR216001950",2475,"PAR226001950",3351,"PAR336001950",4853," - "," - ","PAR217501950",2929,"PAR227501950",3947,"PAR337501950",5759," - "," - ","PAR219001950",3362,"PAR229001950",4496,"PAR339001950",6590]
[2100,42," - "," - ","PAR216002100",2665,"PAR226002100",3609,"PAR336002100",5226," - "," - ","PAR217502100",3154,"PAR227502100",4250,"PAR337502100",6202," - "," - ","PAR219002100",3620,"PAR229002100",4841,"PAR339002100",7097]
[2250,45," - "," - ","PAR216002250",2856,"PAR226002250",3866,"PAR336002250",5600," - "," - ","PAR217502250",3380,"PAR227502250",4554,"PAR337502250",6645," - "," - ","PAR219002250",3879,"PAR229002250",5187,"PAR339002250",7604]
[2400,48," - "," - ","PAR216002400",3046,"PAR226002400",4124,"PAR336002400",5973," - "," - ","PAR217502400",3605,"PAR227502400",4858,"PAR337502400",7088," - "," - ","PAR219002400",4138,"PAR229002400",5533,"PAR339002400",8111]
[2550,51," - "," - ","PAR216002550",3236,"PAR226002550",4382,"PAR336002550",6346," - "," - ","PAR217502550",3830,"PAR227502550",5161,"PAR337502550",7531," - "," - ","PAR219002550",4396,"PAR229002550",5879,"PAR339002550",8617]
[2700,54," - "," - ","PAR216002700",3427,"PAR226002700",4640,"PAR336002700",6720," - "," - ","PAR217502700",4055,"PAR227502700",5465,"PAR337502700",7974," - "," - ","PAR219002700",4655,"PAR229002700",6225,"PAR339002700",9124]
[3000,60," - "," - ","PAR216003000",3808,"PAR226003000",5155,"PAR336003000",7466," - "," - ","PAR217503000",4506,"PAR227503000",6072,"PAR337503000",8860," - "," - ","PAR219003000",5172,"PAR229003000",6916,"PAR339003000",10138]
[]
[]
[]
["Tableau de référence"]
[]
["PENTE :",null,1.3435999999999999,null,1.3096000000000001,null,1.3153999999999999,null,1.3144,null,1.3382000000000001,null,1.3209,null,1.3208,null,1.3224,null,1.3329,null,1.3322000000000001,null,1.3261000000000001,null,1.3323]
["Hauteur",null,300,null,null,null,null,null,null,null,400,null,null,null,null,null,null,null,500]
["Type",null,"PAR11",null,"PAR21",null,"PAR22",null,"PAR33",null,"PAR11",null,"PAR21",null,"PAR22",null,"PAR33",null,"PAR11",null,"PAR21",null,"PAR22",null,"PAR33"]
["Longueur (mm)","Nombre éléments","Modèle","Watt \nDt 50°C","Modèle","Watt \nDt 50°C","Modèle","Watt \nDt 50°C","Modèle","Watt \nDt 50°C","Modèle","Watt \nDt 50°C","Modèle","Watt \nDt 50°C","Modèle","Watt \nDt 50°C","Modèle","Watt \nDt 50°C","Modèle","Watt \nDt 50°C","Modèle","Watt \nDt 50°C","Modèle","Watt \nDt 50°C","Modèle","Watt \nDt 50°C"]
[450,{"$f":"A62/50","v":9},{"$f":"IF(D62=\"\",\" - \",IF(LEN($A62)=3,C$60&$C$59&\"0\"&$A62,C$60&$C$59&$A62))","v":"PAR113000450"},242,{"$f":"IF(F62=\"\",\" - \",IF(LEN($A62)=3,E$60&$C$59&\"0\"&$A62,E$60&$C$59&$A62))","v":"PAR213000450"},339,{"$f":"IF(H62=\"\",\" - \",IF(LEN($A62)=3,G$60&$C$59&\"0\"&$A62,G$60&$C$59&$A62))","v":"PAR223000450"},456,{"$f":"IF(J62=\"\",\" - \",IF(LEN($A62)=3,I$60&$C$59&\"0\"&$A62,I$60&$C$59&$A62))","v":"PAR333000450"},638,{"$f":"IF(L62=\"\",\" - \",IF(LEN($A62)=3,K$60&$K$59&\"0\"&$A62,K$60&$K$59&$A62))","v":"PAR114000450"},306,{"$f":"IF(N62=\"\",\" - \",IF(LEN($A62)=3,M$60&$K$59&\"0\"&$A62,M$60&$K$59&$A62))","v":"PAR214000450"},421,{"$f":"IF(P62=\"\",\" - \",IF(LEN($A62)=3,O$60&$K$59&\"0\"&$A62,O$60&$K$59&$A62))","v":"PAR224000450"},569,{"$f":"IF(R62=\"\",\" - \",IF(LEN($A62)=3,Q$60&$K$59&\"0\"&$A62,Q$60&$K$59&$A62))","v":"PAR334000450"},809,{"$f":"IF(T62=\"\",\" - \",IF(LEN($A62)=3,S$60&$S$59&\"0\"&$A62,S$60&$S$59&$A62))","v":"PAR115000450"},366,{"$f":"IF(V62=\"\",\" - \",IF(LEN($A62)=3,U$60&$S$59&\"0\"&$A62,U$60&$S$59&$A62))","v":"PAR215000450"},498,{"$f":"IF(X62=\"\",\" - \",IF(LEN($A62)=3,W$60&$S$59&\"0\"&$A62,W$60&$S$59&$A62))","v":"PAR225000450"},675,{"$f":"IF(Z62=\"\",\" - \",IF(LEN($A62)=3,Y$60&$S$59&\"0\"&$A62,Y$60&$S$59&$A62))","v":"PAR335000450"},970]
[600,{"$f":"A63/50","v":12},"PAR113000600",323,"PAR213000600",453,"PAR223000600",608,"PAR333000600",850,"PAR114000600",408,"PAR214000600",561,"PAR224000600",759,"PAR334000600",1079,{"$f":"IF(T63=\"\",\" - \",IF(LEN($A63)=3,S$60&$S$59&\"0\"&$A63,S$60&$S$59&$A63))","v":"PAR115000600"},489,"PAR215000600",664,"PAR225000600",900,"PAR335000600",1293]
[750,15,"PAR113000750",404,"PAR213000750",566,"PAR223000750",759,"PAR333000750",1063,"PAR114000750",510,"PAR214000750",702,"PAR224000750",949,"PAR334000750",1349,"PAR115000750",611,"PAR215000750",830,"PAR225000750",1124,"PAR335000750",1616]
[900,18,"PAR113000900",485,"PAR213000900",679,"PAR223000900",911,"PAR333000900",1275,"PAR114000900",612,"PAR214000900",842,"PAR224000900",1139,"PAR334000900",1619,"PAR115000900",733,"PAR215000900",996,"PAR225000900",1349,"PAR335000900",1939]
[1050,21,"PAR113001050",565,"PAR213001050",792,"PAR223001050",1063,"PAR333001050",1488,"PAR114001050",714,"PAR214001050",983,"PAR224001050",1328,"PAR334001050",1889,"PAR115001050",855,"PAR215001050",1162,"PAR225001050",1574,"PAR335001050",2262]
[1200,24,"PAR113001200",646,"PAR213001200",905,"PAR223001200",1215,"PAR333001200",1701,"PAR114001200",816,"PAR214001200",1123,"PAR224001200",1518,"PAR334001200",2158,"PAR115001200",977,"PAR215001200",1328,"PAR225001200",1799,"PAR335001200",2586]
[1350,27,"PAR113001350",727,"PAR213001350",1018,"PAR223001350",1367,"PAR333001350",1913,"PAR114001350",918,"PAR214001350",1263,"PAR224001350",1708,"PAR334001350",2428,"PAR115001350",1099,"PAR215001350",1494,"PAR225001350",2024,"PAR335001350",2909]
[1500,30,"PAR113001500",808,"PAR213001500",1132,"PAR223001500",1519,"PAR333001500",2126,"PAR114001500",1020,"PAR214001500",1404,"PAR224001500",1898,"PAR334001500",2698,"PAR115001500",1221,"PAR215001500",1660,"PAR225001500",2249,"PAR335001500",3232]
[1650,33,"PAR113001650",888,"PAR213001650",1245,"PAR223001650",1671,"PAR333001650",2338,"PAR114001650",1122,"PAR214001650",1544,"PAR224001650",2087,"PAR334001650",2968,"PAR115001650",1343,"PAR215001650",1826,"PAR225001650",2474,"PAR335001650",3555]
[1800,36," - ",null,"PAR213001800",1358,"PAR223001800",1823,"PAR333001800",2551," - ",null,"PAR214001800",1684,"PAR224001800",2277,"PAR334001800",3237," - ",null,"PAR215001800",1992,"PAR225001800",2699,"PAR335001800",3878]
[1950,39," - ",null,"PAR213001950",1471,"PAR223001950",1975,"PAR333001950",2764," - ",null,"PAR214001950",1825,"PAR224001950",2467,"PAR334001950",3507," - ",null,"PAR215001950",2158,"PAR225001950",2923,"PAR335001950",4201]
[2100,42," - ",null,"PAR213002100",1584,"PAR223002100",2126,"PAR333002100",2976," - ",null,"PAR214002100",1965,"PAR224002100",2657,"PAR334002100",3777," - ",null,"PAR215002100",2324,"PAR225002100",3148,"PAR335002100",4525]
[2250,45," - ",null,"PAR213002250",1697,"PAR223002250",2278,"PAR333002250",3189," - ",null,"PAR214002250",2106,"PAR224002250",2846,"PAR334002250",4047," - ",null,"PAR215002250",2490,"PAR225002250",3373,"PAR335002250",4848]
[2400,48," - ",null,"PAR213002400",1811,"PAR223002400",2430,"PAR333002400",3401," - ",null,"PAR214002400",2246,"PAR224002400",3036,"PAR334002400",4317," - ",null,"PAR215002400",2656,"PAR225002400",3598,"PAR335002400",5171]
[2550,51," - ",null,"PAR213002550",1924,"PAR223002550",2582,"PAR333002550",3614," - ",null,"PAR214002550",2386,"PAR224002550",3226,"PAR334002550",4586," - ",null,"PAR215002550",2822,"PAR225002550",3823,"PAR335002550",5494]
[2700,54," - ",null,"PAR213002700",2037,"PAR223002700",2734,"PAR333002700",3826," - ",null,"PAR214002700",2527,"PAR224002700",3416,"PAR334002700",4856," - ",null,"PAR215002700",2988,"PAR225002700",4048,"PAR335002700",5817]
[3000,60," - ",null,"PAR213003000",2263,"PAR223003000",3038,"PAR333003000",4252," - ",null,"PAR214003000",2807,"PAR224003000",3795,"PAR334003000",5396," - ",null,"PAR215003000",3320,"PAR225003000",4498,"PAR335003000",6464]
[]
["PENTE :",null,1.3274999999999999,null,1.3434999999999999,null,1.3314999999999999,null,1.3412999999999999,null,1.3224,null,1.3584000000000001,null,1.3496999999999999,null,1.3595999999999999,null,1.3171999999999999,null,1.3732,null,1.3677999999999999,null,1.3778999999999999,null,null,null,null,null,null,null,null,null,null,null,null,null,null,null,null,null,null,1.3540000000000001]
["Hauteur",null,600,null,null,null,null,null,null,null,750,null,null,null,null,null,null,null,900]
["Type",null,"PAR11",null,"PAR21",null,"PAR22",null,"PAR33",null,"PAR11",null,"PAR21",null,"PAR22",null,"PAR33",null,"PAR11",null,"PAR21",null,"PAR22",null,"PAR33"]
["Longueur (mm)","Nombre éléments","Modèle","Watt \nDt 50°C","Modèle","Watt \nDt 50°C","Modèle","Watt \nDt 50°C","Modèle","Watt \nDt 50°C","Modèle","Watt \nDt 50°C","Modèle","Watt \nDt 50°C","Modèle","Watt \nDt 50°C","Modèle","Watt \nDt 50°C","Modèle",null,"Modèle","Watt \nDt 50°C","Modèle","Watt \nDt 50°C","Modèle","Watt \nDt 50°C"]
[450,{"$f":"A84/50","v":9},{"$f":"IF(D84=\"\",\" - \",IF(LEN($A62)=3,C$82&$C$81&\"0\"&$A62,C$82&$C$81&$A62))","v":"PAR116000450"},424,{"$f":"IF(F84=\"\",\" - \",IF(LEN($A62)=3,E$82&$C$81&\"0\"&$A62,E$82&$C$81&$A62))","v":"PAR216000450"},571,{"$f":"IF(H84=\"\",\" - \",IF(LEN($A62)=3,G$82&$C$81&\"0\"&$A62,G$82&$C$81&$A62))","v":"PAR226000450"},773,{"$f":"IF(J84=\"\",\" - \",IF(LEN($A62)=3,I$82&$C$81&\"0\"&$A62,I$82&$C$81&$A62))","v":"PAR336000450"},1120,{"$f":"IF(L84=\"\",\" - \",IF(LEN($A84)=3,K$82&$K$81&\"0\"&$A84,K$82&$K$81&$A84))","v":"PAR117500450"},506,{"$f":"IF(N84=\"\",\" - \",IF(LEN($A84)=3,M$82&$K$81&\"0\"&$A84,M$82&$K$81&$A84))","v":"PAR217500450"},676,{"$f":"IF(P84=\"\",\" - \",IF(LEN($A84)=3,O$82&$K$81&\"0\"&$A84,O$82&$K$81&$A84))","v":"PAR227500450"},911,{"$f":"IF(R84=\"\",\" - \",IF(LEN($A84)=3,Q$82&$K$81&\"0\"&$A84,Q$82&$K$81&$A84))","v":"PAR337500450"},1329,{"$f":"IF(T84=\"\",\" - \",IF(LEN($A84)=3,S$82&$S$81&\"0\"&$A84,S$82&$S$81&$A84))","v":"PAR119000450"},584,{"$f":"IF(V84=\"\",\" - \",IF(LEN($A84)=3,U$82&$S$81&\"0\"&$A84,U$82&$S$81&$A84))","v":"PAR219000450"},776,{"$f":"IF(X84=\"\",\" - \",IF(LEN($A84)=3,W$82&$S$81&\"0\"&$A84,W$82&$S$81&$A84))","v":"PAR229000450"},1037,{"$f":"IF(Z84=\"\",\" - \",IF(LEN($A84)=3,Y$82&$S$81&\"0\"&$A84,Y$82&$S$81&$A84))","v":"PAR339000450"},1521]
[600,{"$f":"A85/50","v":12},"PAR116000600",565,"PAR216000600",762,"PAR226000600",1031,"PAR336000600",1493,"PAR117500600",675,"PAR217500600",901,"PAR227500600",1214,"PAR337500600",1772,"PAR119000600",779,"PAR219000600",1034,"PAR229000600",1383,"PAR339000600",2028]
[750,15,"PAR116000750",707,"PAR216000750",952,"PAR226000750",1289,"PAR336000750",1867,"PAR117500750",844,"PAR217500750",1127,"PAR227500750",1518,"PAR337500750",2215,"PAR119000750",974,"PAR219000750",1293,"PAR229000750",1729,"PAR339000750",2535]
[900,18,"PAR116000900",848,"PAR216000900",1142,"PAR226000900",1547,"PAR336000900",2240,"PAR117500900",1013,"PAR217500900",1352,"PAR227500900",1822,"PAR337500900",2658,"PAR119000900",1168,"PAR219000900",1552,"PAR229000900",2075,"PAR339000900",3041]
[1050,21,"PAR116001050",990,"PAR216001050",1333,"PAR226001050",1804,"PAR336001050",2613,"PAR117501050",1181,"PAR217501050",1577,"PAR227501050",2125,"PAR337501050",3101,"PAR119001050",1363,"PAR219001050",1810,"PAR229001050",2421,"PAR339001050",3548]
[1200,24,"PAR116001200",1131,"PAR216001200",1523,"PAR226001200",2062,"PAR336001200",2987,"PAR117501200",1350,"PAR217501200",1802,"PAR227501200",2429,"PAR337501200",3544,"PAR119001200",1558,"PAR219001200",2069,"PAR229001200",2766,"PAR339001200",4055]
[1350,27,"PAR116001350",1272,"PAR216001350",1713,"PAR226001350",2320,"PAR336001350",3360,"PAR117501350",1519,"PAR217501350",2028,"PAR227501350",2732,"PAR337501350",3987,"PAR119001350",1753,"PAR219001350",2327,"PAR229001350",3112,"PAR339001350",4562]
[1500,30,"PAR116001500",1414,"PAR216001500",1904,"PAR226001500",2578,"PAR336001500",3733,"PAR117501500",1688,"PAR217501500",2253,"PAR227501500",3036,"PAR337501500",4430,"PAR119001500",1947,"PAR219001500",2586,"PAR229001500",3458,"PAR339001500",5069]
[1650,33,"PAR116001650",1555,"PAR216001650",2094,"PAR226001650",2835,"PAR336001650",4107,"PAR117501650",1856,"PAR217501650",2478,"PAR227501650",3340,"PAR337501650",4873,"PAR119001650",2142,"PAR219001650",2845,"PAR229001650",3804,"PAR339001650",5576]
[1800,36," - ",null,"PAR216001800",2285,"PAR226001800",3093,"PAR336001800",4480," - ",null,"PAR217501800",2704,"PAR227501800",3643,"PAR337501800",5316," - ",null,"PAR219001800",3103,"PAR229001800",4150,"PAR339001800",6083]
[1950,39," - ",null,"PAR216001950",2475,"PAR226001950",3351,"PAR336001950",4853," - ",null,"PAR217501950",2929,"PAR227501950",3947,"PAR337501950",5759," - ",null,"PAR219001950",3362,"PAR229001950",4496,"PAR339001950",6590]
[2100,42," - ",null,"PAR216002100",2665,"PAR226002100",3609,"PAR336002100",5226," - ",null,"PAR217502100",3154,"PAR227502100",4250,"PAR337502100",6202," - ",null,"PAR219002100",3620,"PAR229002100",4841,"PAR339002100",7097]
[2250,45," - ",null,"PAR216002250",2856,"PAR226002250",3866,"PAR336002250",5600," - ",null,"PAR217502250",3380,"PAR227502250",4554,"PAR337502250",6645," - ",null,"PAR219002250",3879,"PAR229002250",5187,"PAR339002250",7604]
[2400,48," - ",null,"PAR216002400",3046,"PAR226002400",4124,"PAR336002400",5973," - ",null,"PAR217502400",3605,"PAR227502400",4858,"PAR337502400",7088," - ",null,"PAR219002400",4138,"PAR229002400",5533,"PAR339002400",8111]
[2550,51," - ",null,"PAR216002550",3236,"PAR226002550",4382,"PAR336002550",6346," - ",null,"PAR217502550",3830,"PAR227502550",5161,"PAR337502550",7531," - ",null,"PAR219002550",4396,"PAR229002550",5879,"PAR339002550",8617]
[2700,54," - ",null,"PAR216002700",3427,"PAR226002700",4640,"PAR336002700",6720," - ",null,"PAR217502700",4055,"PAR227502700",5465,"PAR337502700",7974," - ",null,"PAR219002700",4655,"PAR229002700",6225,"PAR339002700",9124]
[3000,60," - ",null,"PAR216003000",3808,"PAR226003000",5155,"PAR336003000",7466," - ",null,"PAR217503000",4506,"PAR227503000",6072,"PAR337503000",8860," - ",null,"PAR219003000",5172,"PAR229003000",6916,"PAR339003000",10138]

{"sheet":"PARADA PLINTHE","index":10,"n_rows":88,"n_cols":26,"rows_kept":88,"cut":false,"hidden":false,"merged":[[2,2,2,6],[3,2,3,6],[4,2,4,6],[11,0,11,1],[11,2,11,3],[11,4,11,5],[11,6,11,7],[10,0,10,1],[10,2,10,7],[29,0,29,1],[29,2,29,7],[30,0,30,1],[30,2,30,3],[30,4,30,5],[30,6,30,7],[51,0,51,1],[51,2,51,3],[51,4,51,5],[51,6,51,7],[52,0,52,1],[52,2,52,7],[53,0,53,1],[53,2,53,3],[53,4,53,5],[53,6,53,7],[70,0,70,1],[70,2,70,3],[70,4,70,5],[70,6,70,7],[71,0,71,1],[71,2,71,7],[72,0,72,1],[72,2,72,3],[72,4,72,5],[72,6,72,7]]}
["Programme de calcul de la puissance thermique: PARADA PLINTHE et PARADA PLINTHE DOUBLE"]
[]
["Te",75,"<= Entrez la température à l'entrée en C°"]
["Ts",65,"<= Entrez la température à la sortie en C°"]
["Ti",20,"<= Entrez la température ambiante en C°"]
["Rapport",{"$f":"(B4-B5)/(B3-B5)","v":0.81818181818181823}]
["Delta T",{"$f":"((B3+B4)/2)-B5","v":50}]
["Delta T2",{"$f":"(B3-B4)/LN((B3-B5)/(B4-B5))","v":49.83288654563971},"Si Rapport < 0,7"]
[]
[]
["Hauteur",null,{"$f":"C53","v":200}]
["Type",null,{"$f":"C54","v":"FCV22"},null,{"$f":"E54","v":"FCV33"},null,{"$f":"G54","v":"FCV44"}]
["Longueur (mm)","Nombre éléments","Modèle","Puissance (watts)     ","Modèle","Puissance (watts)     ","Modèle","Puissance (watts)     "]
[{"$f":"A56","v":600},{"$f":"B56","v":12},{"$f":"C56","v":"FCV222000600"},{"$f":"IF(D56=\"\",\" - \",IF($B$6<0.7,D56*POWER($B$8/50,C$52),D56*POWER($B$7/50,C$52)))","v":434},{"$f":"E56","v":"FCV332000600"},{"$f":"IF(F56=\"\",\" - \",IF($B$6<0.7,F56*POWER($B$8/50,E$52),F56*POWER($B$7/50,E$52)))","v":628},{"$f":"G56","v":"FCV442000600"},{"$f":"IF(H56=\"\",\" - \",IF($B$6<0.7,H56*POWER($B$8/50,G$52),H56*POWER($B$7/50,G$52)))","v":803},null,null,null,null,null,null,null,null,null,null,null,null,null,","]
[{"$f":"A57","v":700},14,"FCV222000700",507,{"$f":"E57","v":"FCV332000700"},733,{"$f":"G57","v":"FCV442000700"},937]
[800,16,"FCV222000800",579,"FCV332000800",838,"FCV442000800",1071]
[900,18,"FCV222000900",652,"FCV332000900",942,"FCV442000900",1205]
[1000,20,"FCV222001000",724,"FCV332001000",1047,"FCV442001000",1339]
[1100,22,"FCV222001100",796,"FCV332001100",1152,"FCV442001100",1473]
[1200,24,"FCV222001200",869,"FCV332001200",1256,"FCV442001200",1607]
[1400,28,"FCV222001400",1014,"FCV332001400",1466,"FCV442001400",1875]
[1600,32,"FCV222001600",1158,"FCV332001600",1675,"FCV442001600",2142]
[1800,36,"FCV222001800",1303,"FCV332001800",1885,"FCV442001800",2410]
[2000,40,"FCV222002000",1448,"FCV332002000",2094,"FCV442002000",2678]
[2300,46,"FCV222002300",1665,"FCV332002300",2408,"FCV442002300",3080]
[2600,52,"FCV222002600",1882,"FCV332002600",2722,"FCV442002600",3481]
[3000,60,"FCV222003000",2172,"FCV332003000",3141,"FCV442003000",4017]
[]
[]
["Hauteur",null,{"$f":"C72","v":200}]
["Type",null,{"$f":"C73","v":"FFCV22"},null,{"$f":"E73","v":"FFCV33"},null,{"$f":"G73","v":"FFCV44"}]
["Longueur (mm)","Nombre éléments","Modèle","Puissance (watts)     ","Modèle","Puissance (watts)     ","Modèle","Puissance (watts)     "]
[{"$f":"A75","v":600},{"$f":"B75","v":12},{"$f":"C75","v":"FFCV222000600"},{"$f":"IF(D75=\"\",\" - \",IF($B$6<0.7,D75*POWER($B$8/50,C$71),D75*POWER($B$7/50,C$71)))","v":430},{"$f":"E75","v":"FFCV332000600"},{"$f":"IF(F75=\"\",\" - \",IF($B$6<0.7,F75*POWER($B$8/50,E$71),F75*POWER($B$7/50,E$71)))","v":598},{"$f":"G75","v":"FFCV442000600"},{"$f":"IF(H75=\"\",\" - \",IF($B$6<0.7,H75*POWER($B$8/50,G$71),H75*POWER($B$7/50,G$71)))","v":793}]
[{"$f":"A76","v":700},14,"FFCV222000700",502,"FFCV332000700",697,"FFCV442000700",925]
[800,16,"FFCV222000800",574,"FFCV332000800",797,"FFCV442000800",1057]
[900,18,"FFCV222000900",645,"FFCV332000900",896,"FFCV442000900",1189]
[1000,20,"FFCV222001000",717,"FFCV332001000",996,"FFCV442001000",1321]
[1100,22,"FFCV222001100",789,"FFCV332001100",1096,"FFCV442001100",1453]
[1200,24,"FFCV222001200",860,"FFCV332001200",1195,"FFCV442001200",1585]
[1400,28,"FFCV222001400",1004,"FFCV332001400",1394,"FFCV442001400",1849]
[1600,32,"FFCV222001600",1147,"FFCV332001600",1594,"FFCV442001600",2114]
[1800,36,"FFCV222001800",1291,"FFCV332001800",1793,"FFCV442001800",2378]
[2000,40,"FFCV222002000",1434,"FFCV332002000",1992,"FFCV442002000",2642]
[2300,46,"FFCV222002300",1649,"FFCV332002300",2291,"FFCV442002300",3038]
[2600,52,"FFCV222002600",1864,"FFCV332002600",2590,"FFCV442002600",3435]
[3000,60,"FFCV222003000",2151,"FFCV332003000",2988,"FFCV442003000",3963]
[]
[]
[]
["Tableau de référence"]
[]
["PENTE :",null,1.3238000000000001,null,1.3337000000000001,null,1.3432999999999999]
["Hauteur",null,200]
["Type",null,"FCV22",null,"FCV33",null,"FCV44"]
["Longueur (mm)","Nombre éléments","Modèle","Watt \nDt 50°C","Modèle","Watt \nDt 50°C","Modèle","Watt \nDt 50°C"]
[600,{"$f":"A56/50","v":12},{"$f":"IF(D56=\"\",\" - \",IF(LEN($A56)=3,C$54&$C$53&\"0\"&$A56,C$54&$C$53&$A56))","v":"FCV222000600"},434,{"$f":"IF(F56=\"\",\" - \",IF(LEN($A56)=3,E$54&$C$53&\"0\"&$A56,E$54&$C$53&$A56))","v":"FCV332000600"},628,{"$f":"IF(H56=\"\",\" - \",IF(LEN($A56)=3,G$54&$C$53&\"0\"&$A56,G$54&$C$53&$A56))","v":"FCV442000600"},803]
[700,{"$f":"A57/50","v":14},"FCV222000700",507,"FCV332000700",733,"FCV442000700",937]
[800,16,"FCV222000800",579,"FCV332000800",838,"FCV442000800",1071]
[900,18,"FCV222000900",652,"FCV332000900",942,"FCV442000900",1205]
[1000,20,"FCV222001000",724,"FCV332001000",1047,"FCV442001000",1339]
[1100,22,"FCV222001100",796,"FCV332001100",1152,"FCV442001100",1473]
[1200,24,"FCV222001200",869,"FCV332001200",1256,"FCV442001200",1607]
[1400,28,"FCV222001400",1014,"FCV332001400",1466,"FCV442001400",1875]
[1600,32,"FCV222001600",1158,"FCV332001600",1675,"FCV442001600",2142]
[1800,36,"FCV222001800",1303,"FCV332001800",1885,"FCV442001800",2410]
[2000,40,"FCV222002000",1448,"FCV332002000",2094,"FCV442002000",2678]
[2300,46,"FCV222002300",1665,"FCV332002300",2408,"FCV442002300",3080]
[2600,52,"FCV222002600",1882,"FCV332002600",2722,"FCV442002600",3481]
[3000,60,"FCV222003000",2172,"FCV332003000",3141,"FCV442003000",4017]
[]
["PENTE :",null,1.3176000000000001,null,1.3458000000000001,null,1.3395999999999999,null,null,null,null,null,null,null,null,null,null,null,null,null,null,null,null,null,null,1.3540000000000001]
["Hauteur",null,200]
["Type",null,"FFCV22",null,"FFCV33",null,"FFCV44"]
["Longueur (mm)","Nombre éléments","Modèle","Watt \nDt 50°C","Modèle","Watt \nDt 50°C","Modèle","Watt \nDt 50°C"]
[600,{"$f":"A75/50","v":12},{"$f":"IF(D75=\"\",\" - \",IF(LEN($A56)=3,C$73&$C$72&\"0\"&$A56,C$73&$C$72&$A56))","v":"FFCV222000600"},430,{"$f":"IF(F75=\"\",\" - \",IF(LEN($A56)=3,E$73&$C$72&\"0\"&$A56,E$73&$C$72&$A56))","v":"FFCV332000600"},598,{"$f":"IF(H75=\"\",\" - \",IF(LEN($A56)=3,G$73&$C$72&\"0\"&$A56,G$73&$C$72&$A56))","v":"FFCV442000600"},793]
[700,{"$f":"A76/50","v":14},"FFCV222000700",502,"FFCV332000700",697,"FFCV442000700",925]
[800,16,"FFCV222000800",574,"FFCV332000800",797,"FFCV442000800",1057]
[900,18,"FFCV222000900",645,"FFCV332000900",896,"FFCV442000900",1189]
[1000,20,"FFCV222001000",717,"FFCV332001000",996,"FFCV442001000",1321]
[1100,22,"FFCV222001100",789,"FFCV332001100",1096,"FFCV442001100",1453]
[1200,24,"FFCV222001200",860,"FFCV332001200",1195,"FFCV442001200",1585]
[1400,28,"FFCV222001400",1004,"FFCV332001400",1394,"FFCV442001400",1849]
[1600,32,"FFCV222001600",1147,"FFCV332001600",1594,"FFCV442001600",2114]
[1800,36,"FFCV222001800",1291,"FFCV332001800",1793,"FFCV442001800",2378]
[2000,40,"FFCV222002000",1434,"FFCV332002000",1992,"FFCV442002000",2642]
[2300,46,"FFCV222002300",1649,"FFCV332002300",2291,"FFCV442002300",3038]
[2600,52,"FFCV222002600",1864,"FFCV332002600",2590,"FFCV442002600",3435]
[3000,60,"FFCV222003000",2151,"FFCV332003000",2988,"FFCV442003000",3963]

{"sheet":"RAMO","index":11,"n_rows":100,"n_cols":44,"rows_kept":100,"cut":false,"hidden":false,"merged":[[10,0,10,1],[10,2,10,9],[2,2,2,6],[3,2,3,6],[4,2,4,6],[32,0,32,1],[32,2,32,9],[32,10,32,17],[32,18,32,25],[10,18,10,25],[11,0,11,1],[11,2,11,3],[11,4,11,5],[11,6,11,7],[11,8,11,9],[11,10,11,11],[11,12,11,13],[11,14,11,15],[11,16,11,17],[10,10,10,17],[11,18,11,19],[11,20,11,21],[11,22,11,23],[11,24,11,25],[33,24,33,25],[33,18,33,19],[33,20,33,21],[33,22,33,23],[33,12,33,13],[33,14,33,15],[33,16,33,17],[57,0,57,1],[57,2,57,3],[57,4,57,5],[57,6,57,7],[57,8,57,9],[33,0,33,1],[33,2,33,3],[33,4,33,5],[33,6,33,7],[33,8,33,9],[33,10,33,11],[57,18,57,19],[57,20,57,21],[57,22,57,23],[57,24,57,25],[58,0,58,1],[58,2,58,9],[58,10,58,17],[58,18,58,25],[57,10,57,11],[57,12,57,13],[57,14,57,15],[57,16,57,17],[59,16,59,17],[59,18,59,19],[59,20,59,21],[59,22,59,23],[59,0,59,1],[59,2,59,3],[59,4,59,5],[59,6,59,7],[59,8,59,9],[59,10,59,11],[80,0,80,1],[80,2,80,9],[80,10,80,17],[80,18,80,25],[59,24,59,25],[79,0,79,1],[79,2,79,3],[79,4,79,5],[79,6,79,7],[79,8,79,9],[79,10,79,11],[79,12,79,13],[79,14,79,15],[79,16,79,17],[59,12,59,13],[59,14,59,15],[81,10,81,11],[79,18,79,19],[79,20,79,21],[79,22,79,23],[79,24,79,25],[81,24,81,25],[81,12,81,13],[81,14,81,15],[81,16,81,17],[81,18,81,19],[81,20,81,21],[81,22,81,23],[81,0,81,1],[81,2,81,3],[81,4,81,5],[81,6,81,7],[81,8,81,9]]}
["Programme de calcul de la puissance thermique: RAMO"]
[]
["Te",75,"<= Entrez la température à l'entrée en C°"]
["Ts",65,"<= Entrez la température à la sortie en C°"]
["Ti",20,"<= Entrez la température ambiante en C°"]
["Rapport",{"$f":"(B4-B5)/(B3-B5)","v":0.81818181818181823}]
["Delta T",{"$f":"((B3+B4)/2)-B5","v":50}]
["Delta T2",{"$f":"(B3-B4)/LN((B3-B5)/(B4-B5))","v":49.83288654563971},"Si Rapport < 0,7"]
[]
[]
["Hauteur",null,{"$f":"C59","v":300},null,null,null,null,null,null,null,{"$f":"K59","v":400},null,null,null,null,null,null,null,{"$f":"S59","v":500}]
["Type",null,{"$f":"C60","v":"RA11"},null,{"$f":"E60","v":"RA21"},null,{"$f":"G60","v":"RA22"},null,{"$f":"I60","v":"RA33"},null,{"$f":"K60","v":"RA11"},null,{"$f":"M60","v":"RA21"},null,{"$f":"O60","v":"RA22"},null,{"$f":"Q60","v":"RA33"},null,{"$f":"S60","v":"RA11"},null,{"$f":"U60","v":"RA21"},null,{"$f":"W60","v":"RA22"},null,{"$f":"Y60","v":"RA33"}]
["Longueur (mm)","Nombre éléments","Modèle","Puissance (watts)     ","Modèle","Puissance (watts)     ","Modèle","Puissance (watts)     ","Modèle","Puissance (watts)     ","Modèle","Puissance (watts)     ","Modèle","Puissance (watts)     ","Modèle","Puissance (watts)     ","Modèle","Puissance (watts)     ","Modèle","Puissance (watts)     ","Modèle","Puissance (watts)     ","Modèle","Puissance (watts)     ","Modèle","Puissance (watts)     "]
[{"$f":"A62","v":450},{"$f":"B62","v":9},{"$f":"C62","v":"RA113000450"},{"$f":"IF(D62=\"\",\" - \",IF($B$6<0.7,D62*POWER($B$8/50,C$58),D62*POWER($B$7/50,C$58)))","v":242},{"$f":"E62","v":"RA213000450"},{"$f":"IF(F62=\"\",\" - \",IF($B$6<0.7,F62*POWER($B$8/50,E$58),F62*POWER($B$7/50,E$58)))","v":339},{"$f":"G62","v":"RA223000450"},{"$f":"IF(H62=\"\",\" - \",IF($B$6<0.7,H62*POWER($B$8/50,G$58),H62*POWER($B$7/50,G$58)))","v":456},{"$f":"I62","v":"RA333000450"},{"$f":"IF(J62=\"\",\" - \",IF($B$6<0.7,J62*POWER($B$8/50,I$58),J62*POWER($B$7/50,I$58)))","v":638},{"$f":"K62","v":"RA114000450"},{"$f":"IF(L62=\"\",\" - \",IF($B$6<0.7,L62*POWER($B$8/50,K$58),L62*POWER($B$7/50,K$58)))","v":306},{"$f":"M62","v":"RA214000450"},{"$f":"IF(N62=\"\",\" - \",IF($B$6<0.7,N62*POWER($B$8/50,M$58),N62*POWER($B$7/50,M$58)))","v":421},{"$f":"O62","v":"RA224000450"},{"$f":"IF(P62=\"\",\" - \",IF($B$6<0.7,P62*POWER($B$8/50,O$58),P62*POWER($B$7/50,O$58)))","v":569},{"$f":"Q62","v":"RA334000450"},{"$f":"IF(R62=\"\",\" - \",IF($B$6<0.7,R62*POWER($B$8/50,Q$58),R62*POWER($B$7/50,Q$58)))","v":809},{"$f":"S62","v":"RA115000450"},{"$f":"IF(T62=\"\",\" - \",IF($B$6<0.7,T62*POWER($B$8/50,S$58),T62*POWER($B$7/50,S$58)))","v":366},{"$f":"U62","v":"RA215000450"},{"$f":"IF(V62=\"\",\" - \",IF($B$6<0.7,V62*POWER($B$8/50,U$58),V62*POWER($B$7/50,U$58)))","v":498},{"$f":"W62","v":"RA225000450"},{"$f":"IF(X62=\"\",\" - \",IF($B$6<0.7,X62*POWER($B$8/50,W$58),X62*POWER($B$7/50,W$58)))","v":675},{"$f":"Y62","v":"RA335000450"},{"$f":"IF(Z62=\"\",\" - \",IF($B$6<0.7,Z62*POWER($B$8/50,Y$58),Z62*POWER($B$7/50,Y$58)))","v":970},null,null,null,null,null,null,null,null,null,null,null,null,null,","]
[{"$f":"A63","v":600},12,"RA113000600",{"$f":"IF(D63=\"\",\" - \",IF($B$6<0.7,D63*POWER($B$8/50,C$58),D63*POWER($B$7/50,C$58)))","v":323},{"$f":"E63","v":"RA213000600"},{"$f":"IF(F63=\"\",\" - \",IF($B$6<0.7,F63*POWER($B$8/50,E$58),F63*POWER($B$7/50,E$58)))","v":453},{"$f":"G63","v":"RA223000600"},{"$f":"IF(H63=\"\",\" - \",IF($B$6<0.7,H63*POWER($B$8/50,G$58),H63*POWER($B$7/50,G$58)))","v":608},{"$f":"I63","v":"RA333000600"},{"$f":"IF(J63=\"\",\" - \",IF($B$6<0.7,J63*POWER($B$8/50,I$58),J63*POWER($B$7/50,I$58)))","v":850},{"$f":"K63","v":"RA114000600"},{"$f":"IF(L63=\"\",\" - \",IF($B$6<0.7,L63*POWER($B$8/50,K$58),L63*POWER($B$7/50,K$58)))","v":408},{"$f":"M63","v":"RA214000600"},{"$f":"IF(N63=\"\",\" - \",IF($B$6<0.7,N63*POWER($B$8/50,M$58),N63*POWER($B$7/50,M$58)))","v":561},{"$f":"O63","v":"RA224000600"},{"$f":"IF(P63=\"\",\" - \",IF($B$6<0.7,P63*POWER($B$8/50,O$58),P63*POWER($B$7/50,O$58)))","v":759},{"$f":"Q63","v":"RA334000600"},{"$f":"IF(R63=\"\",\" - \",IF($B$6<0.7,R63*POWER($B$8/50,Q$58),R63*POWER($B$7/50,Q$58)))","v":1079},{"$f":"S63","v":"RA115000600"},{"$f":"IF(T63=\"\",\" - \",IF($B$6<0.7,T63*POWER($B$8/50,S$58),T63*POWER($B$7/50,S$58)))","v":489},{"$f":"U63","v":"RA215000600"},{"$f":"IF(V63=\"\",\" - \",IF($B$6<0.7,V63*POWER($B$8/50,U$58),V63*POWER($B$7/50,U$58)))","v":664},{"$f":"W63","v":"RA225000600"},{"$f":"IF(X63=\"\",\" - \",IF($B$6<0.7,X63*POWER($B$8/50,W$58),X63*POWER($B$7/50,W$58)))","v":900},{"$f":"Y63","v":"RA335000600"},{"$f":"IF(Z63=\"\",\" - \",IF($B$6<0.7,Z63*POWER($B$8/50,Y$58),Z63*POWER($B$7/50,Y$58)))","v":1293}]
[750,15,"RA113000750",404,"RA213000750",566,"RA223000750",759,"RA333000750",1063,"RA114000750",510,"RA214000750",702,"RA224000750",949,"RA334000750",1349,"RA115000750",611,"RA215000750",830,"RA225000750",1124,"RA335000750",1616]
[900,18,"RA113000900",485,"RA213000900",679,"RA223000900",911,"RA333000900",1275,"RA114000900",612,"RA214000900",842,"RA224000900",1139,"RA334000900",1619,"RA115000900",733,"RA215000900",996,"RA225000900",1349,"RA335000900",1939]
[1050,21,"RA113001050",565,"RA213001050",792,"RA223001050",1063,"RA333001050",1488,"RA114001050",714,"RA214001050",983,"RA224001050",1328,"RA334001050",1889,"RA115001050",855,"RA215001050",1162,"RA225001050",1574,"RA335001050",2262]
[1200,24,"RA113001200",646,"RA213001200",905,"RA223001200",1215,"RA333001200",1701,"RA114001200",816,"RA214001200",1123,"RA224001200",1518,"RA334001200",2158,"RA115001200",977,"RA215001200",1328,"RA225001200",1799,"RA335001200",2586]
[1350,27,"RA113001350",727,"RA213001350",1018,"RA223001350",1367,"RA333001350",1913,"RA114001350",918,"RA214001350",1263,"RA224001350",1708,"RA334001350",2428,"RA115001350",1099,"RA215001350",1494,"RA225001350",2024,"RA335001350",2909]
[1500,30,"RA113001500",808,"RA213001500",1132,"RA223001500",1519,"RA333001500",2126,"RA114001500",1020,"RA214001500",1404,"RA224001500",1898,"RA334001500",2698,"RA115001500",1221,"RA215001500",1660,"RA225001500",2249,"RA335001500",3232]
[1650,33,"RA113001650",888,"RA213001650",1245,"RA223001650",1671,"RA333001650",2338,"RA114001650",1122,"RA214001650",1544,"RA224001650",2087,"RA334001650",2968,"RA115001650",1343,"RA215001650",1826,"RA225001650",2474,"RA335001650",3555]
[1800,36," - "," - ","RA213001800",1358,"RA223001800",1823,"RA333001800",2551," - "," - ","RA214001800",1684,"RA224001800",2277,"RA334001800",3237," - "," - ","RA215001800",1992,"RA225001800",2699,"RA335001800",3878]
[1950,39," - "," - ","RA213001950",1471,"RA223001950",1975,"RA333001950",2764," - "," - ","RA214001950",1825,"RA224001950",2467,"RA334001950",3507," - "," - ","RA215001950",2158,"RA225001950",2923,"RA335001950",4201]
[2100,42," - "," - ","RA213002100",1584,"RA223002100",2126,"RA333002100",2976," - "," - ","RA214002100",1965,"RA224002100",2657,"RA334002100",3777," - "," - ","RA215002100",2324,"RA225002100",3148,"RA335002100",4525]
[2250,45," - "," - ","RA213002250",1697,"RA223002250",2278,"RA333002250",3189," - "," - ","RA214002250",2106,"RA224002250",2846,"RA334002250",4047," - "," - ","RA215002250",2490,"RA225002250",3373,"RA335002250",4848]
[2400,48," - "," - ","RA213002400",1811,"RA223002400",2430,"RA333002400",3401," - "," - ","RA214002400",2246,"RA224002400",3036,"RA334002400",4317," - "," - ","RA215002400",2656,"RA225002400",3598,"RA335002400",5171]
[2550,51," - "," - ","RA213002550",1924,"RA223002550",2582,"RA333002550",3614," - "," - ","RA214002550",2386,"RA224002550",3226,"RA334002550",4586," - "," - ","RA215002550",2822,"RA225002550",3823,"RA335002550",5494]
[2700,54," - "," - ","RA213002700",2037,"RA223002700",2734,"RA333002700",3826," - "," - ","RA214002700",2527,"RA224002700",3416,"RA334002700",4856," - "," - ","RA215002700",2988,"RA225002700",4048,"RA335002700",5817]
[3000,60," - "," - ","RA213003000",2263,"RA223003000",3038,"RA333003000",4252," - "," - ","RA214003000",2807,"RA224003000",3795,"RA334003000",5396," - "," - ","RA215003000",3320,"RA225003000",4498,"RA335003000",6464]
[]
[]
["Hauteur",null,{"$f":"C81","v":600},null,null,null,null,null,null,null,{"$f":"K81","v":750},null,null,null,null,null,null,null,{"$f":"S81","v":900}]
["Type",null,{"$f":"C82","v":"RA11"},null,{"$f":"E82","v":"RA21"},null,{"$f":"G82","v":"RA22"},null,{"$f":"I82","v":"RA33"},null,{"$f":"K82","v":"RA11"},null,{"$f":"M82","v":"RA21"},null,{"$f":"O82","v":"RA22"},null,{"$f":"Q82","v":"RA33"},null,{"$f":"S82","v":"RA11"},null,{"$f":"U82","v":"RA21"},null,{"$f":"W82","v":"RA22"},null,{"$f":"Y82","v":"RA33"}]
["Longueur (mm)","Nombre éléments","Modèle","Puissance (watts)     ","Modèle","Puissance (watts)     ","Modèle","Puissance (watts)     ","Modèle","Puissance (watts)     ","Modèle","Puissance (watts)     ","Modèle","Puissance (watts)     ","Modèle","Puissance (watts)     ","Modèle","Puissance (watts)     ","Modèle","Puissance (watts)     ","Modèle","Puissance (watts)     ","Modèle","Puissance (watts)     ","Modèle","Puissance (watts)     "]
[{"$f":"A84","v":450},{"$f":"B84","v":9},{"$f":"C84","v":"RA116000450"},{"$f":"IF(D84=\"\",\" - \",IF($B$6<0.7,D84*POWER($B$8/50,C$80),D84*POWER($B$7/50,C$80)))","v":424},{"$f":"E84","v":"RA216000450"},{"$f":"IF(F84=\"\",\" - \",IF($B$6<0.7,F84*POWER($B$8/50,E$80),F84*POWER($B$7/50,E$80)))","v":571},{"$f":"G84","v":"RA226000450"},{"$f":"IF(H84=\"\",\" - \",IF($B$6<0.7,H84*POWER($B$8/50,G$80),H84*POWER($B$7/50,G$80)))","v":773},{"$f":"I84","v":"RA336000450"},{"$f":"IF(J84=\"\",\" - \",IF($B$6<0.7,J84*POWER($B$8/50,I$80),J84*POWER($B$7/50,I$80)))","v":1120},{"$f":"K84","v":"RA117500450"},{"$f":"IF(L84=\"\",\" - \",IF($B$6<0.7,L84*POWER($B$8/50,K$80),L84*POWER($B$7/50,K$80)))","v":506},{"$f":"M84","v":"RA217500450"},{"$f":"IF(N84=\"\",\" - \",IF($B$6<0.7,N84*POWER($B$8/50,M$80),N84*POWER($B$7/50,M$80)))","v":676},{"$f":"O84","v":"RA227500450"},{"$f":"IF(P84=\"\",\" - \",IF($B$6<0.7,P84*POWER($B$8/50,O$80),P84*POWER($B$7/50,O$80)))","v":911},{"$f":"Q84","v":"RA337500450"},{"$f":"IF(R84=\"\",\" - \",IF($B$6<0.7,R84*POWER($B$8/50,Q$80),R84*POWER($B$7/50,Q$80)))","v":1329},{"$f":"S84","v":"RA119000450"},{"$f":"IF(T84=\"\",\" - \",IF($B$6<0.7,T84*POWER($B$8/50,S$80),T84*POWER($B$7/50,S$80)))","v":584},{"$f":"U84","v":"RA219000450"},{"$f":"IF(V84=\"\",\" - \",IF($B$6<0.7,V84*POWER($B$8/50,U$80),V84*POWER($B$7/50,U$80)))","v":776},{"$f":"W84","v":"RA229000450"},{"$f":"IF(X84=\"\",\" - \",IF($B$6<0.7,X84*POWER($B$8/50,W$80),X84*POWER($B$7/50,W$80)))","v":1037},{"$f":"Y84","v":"RA339000450"},{"$f":"IF(Z84=\"\",\" - \",IF($B$6<0.7,Z84*POWER($B$8/50,Y$80),Z84*POWER($B$7/50,Y$80)))","v":1521}]
[{"$f":"A85","v":600},12,"RA116000600",{"$f":"IF(D85=\"\",\" - \",IF($B$6<0.7,D85*POWER($B$8/50,C$80),D85*POWER($B$7/50,C$80)))","v":565},"RA216000600",{"$f":"IF(F85=\"\",\" - \",IF($B$6<0.7,F85*POWER($B$8/50,E$80),F85*POWER($B$7/50,E$80)))","v":762},"RA226000600",{"$f":"IF(H85=\"\",\" - \",IF($B$6<0.7,H85*POWER($B$8/50,G$80),H85*POWER($B$7/50,G$80)))","v":1031},"RA336000600",{"$f":"IF(J85=\"\",\" - \",IF($B$6<0.7,J85*POWER($B$8/50,I$80),J85*POWER($B$7/50,I$80)))","v":1493},"RA117500600",{"$f":"IF(L85=\"\",\" - \",IF($B$6<0.7,L85*POWER($B$8/50,K$80),L85*POWER($B$7/50,K$80)))","v":675},"RA217500600",{"$f":"IF(N85=\"\",\" - \",IF($B$6<0.7,N85*POWER($B$8/50,M$80),N85*POWER($B$7/50,M$80)))","v":901},"RA227500600",{"$f":"IF(P85=\"\",\" - \",IF($B$6<0.7,P85*POWER($B$8/50,O$80),P85*POWER($B$7/50,O$80)))","v":1214},"RA337500600",{"$f":"IF(R85=\"\",\" - \",IF($B$6<0.7,R85*POWER($B$8/50,Q$80),R85*POWER($B$7/50,Q$80)))","v":1772},"RA119000600",{"$f":"IF(T85=\"\",\" - \",IF($B$6<0.7,T85*POWER($B$8/50,S$80),T85*POWER($B$7/50,S$80)))","v":779},"RA219000600",{"$f":"IF(V85=\"\",\" - \",IF($B$6<0.7,V85*POWER($B$8/50,U$80),V85*POWER($B$7/50,U$80)))","v":1034},"RA229000600",{"$f":"IF(X85=\"\",\" - \",IF($B$6<0.7,X85*POWER($B$8/50,W$80),X85*POWER($B$7/50,W$80)))","v":1383},"RA339000600",{"$f":"IF(Z85=\"\",\" - \",IF($B$6<0.7,Z85*POWER($B$8/50,Y$80),Z85*POWER($B$7/50,Y$80)))","v":2028}]
[750,15,"RA116000750",707,"RA216000750",952,"RA226000750",1289,"RA336000750",1867,"RA117500750",844,"RA217500750",1127,"RA227500750",1518,"RA337500750",2215,"RA119000750",974,"RA219000750",1293,"RA229000750",1729,"RA339000750",2535]
[900,18,"RA116000900",848,"RA216000900",1142,"RA226000900",1547,"RA336000900",2240,"RA117500900",1013,"RA217500900",1352,"RA227500900",1822,"RA337500900",2658,"RA119000900",1168,"RA219000900",1552,"RA229000900",2075,"RA339000900",3041]
[1050,21,"RA116001050",990,"RA216001050",1333,"RA226001050",1804,"RA336001050",2613,"RA117501050",1181,"RA217501050",1577,"RA227501050",2125,"RA337501050",3101,"RA119001050",1363,"RA219001050",1810,"RA229001050",2421,"RA339001050",3548]
[1200,24,"RA116001200",1131,"RA216001200",1523,"RA226001200",2062,"RA336001200",2987,"RA117501200",1350,"RA217501200",1802,"RA227501200",2429,"RA337501200",3544,"RA119001200",1558,"RA219001200",2069,"RA229001200",2766,"RA339001200",4055]
[1350,27,"RA116001350",1272,"RA216001350",1713,"RA226001350",2320,"RA336001350",3360,"RA117501350",1519,"RA217501350",2028,"RA227501350",2732,"RA337501350",3987,"RA119001350",1753,"RA219001350",2327,"RA229001350",3112,"RA339001350",4562]
[1500,30,"RA116001500",1414,"RA216001500",1904,"RA226001500",2578,"RA336001500",3733,"RA117501500",1688,"RA217501500",2253,"RA227501500",3036,"RA337501500",4430,"RA119001500",1947,"RA219001500",2586,"RA229001500",3458,"RA339001500",5069]
[1650,33,"RA116001650",1555,"RA216001650",2094,"RA226001650",2835,"RA336001650",4107,"RA117501650",1856,"RA217501650",2478,"RA227501650",3340,"RA337501650",4873,"RA119001650",2142,"RA219001650",2845,"RA229001650",3804,"RA339001650",5576]
[1800,36," - "," - ","RA216001800",2285,"RA226001800",3093,"RA336001800",4480," - "," - ","RA217501800",2704,"RA227501800",3643,"RA337501800",5316," - "," - ","RA219001800",3103,"RA229001800",4150,"RA339001800",6083]
[1950,39," - "," - ","RA216001950",2475,"RA226001950",3351,"RA336001950",4853," - "," - ","RA217501950",2929,"RA227501950",3947,"RA337501950",5759," - "," - ","RA219001950",3362,"RA229001950",4496,"RA339001950",6590]
[2100,42," - "," - ","RA216002100",2665,"RA226002100",3609,"RA336002100",5226," - "," - ","RA217502100",3154,"RA227502100",4250,"RA337502100",6202," - "," - ","RA219002100",3620,"RA229002100",4841,"RA339002100",7097]
[2250,45," - "," - ","RA216002250",2856,"RA226002250",3866,"RA336002250",5600," - "," - ","RA217502250",3380,"RA227502250",4554,"RA337502250",6645," - "," - ","RA219002250",3879,"RA229002250",5187,"RA339002250",7604]
[2400,48," - "," - ","RA216002400",3046,"RA226002400",4124,"RA336002400",5973," - "," - ","RA217502400",3605,"RA227502400",4858,"RA337502400",7088," - "," - ","RA219002400",4138,"RA229002400",5533,"RA339002400",8111]
[2550,51," - "," - ","RA216002550",3236,"RA226002550",4382,"RA336002550",6346," - "," - ","RA217502550",3830,"RA227502550",5161,"RA337502550",7531," - "," - ","RA219002550",4396,"RA229002550",5879,"RA339002550",8617]
[2700,54," - "," - ","RA216002700",3427,"RA226002700",4640,"RA336002700",6720," - "," - ","RA217502700",4055,"RA227502700",5465,"RA337502700",7974," - "," - ","RA219002700",4655,"RA229002700",6225,"RA339002700",9124]
[3000,60," - "," - ","RA216003000",3808,"RA226003000",5155,"RA336003000",7466," - "," - ","RA217503000",4506,"RA227503000",6072,"RA337503000",8860," - "," - ","RA219003000",5172,"RA229003000",6916,"RA339003000",10138]
[]
[]
[]
["Tableau de référence"]
[]
["PENTE :",null,1.3435999999999999,null,1.3096000000000001,null,1.3153999999999999,null,1.3144,null,1.3382000000000001,null,1.3209,null,1.3208,null,1.3224,null,1.3329,null,1.3322000000000001,null,1.3261000000000001,null,1.3323]
["Hauteur",null,300,null,null,null,null,null,null,null,400,null,null,null,null,null,null,null,500]
["Type",null,"RA11",null,"RA21",null,"RA22",null,"RA33",null,"RA11",null,"RA21",null,"RA22",null,"RA33",null,"RA11",null,"RA21",null,"RA22",null,"RA33"]
["Longueur (mm)","Nombre éléments","Modèle","Watt \nDt 50°C","Modèle","Watt \nDt 50°C","Modèle","Watt \nDt 50°C","Modèle","Watt \nDt 50°C","Modèle","Watt \nDt 50°C","Modèle","Watt \nDt 50°C","Modèle","Watt \nDt 50°C","Modèle","Watt \nDt 50°C","Modèle","Watt \nDt 50°C","Modèle","Watt \nDt 50°C","Modèle","Watt \nDt 50°C","Modèle","Watt \nDt 50°C"]
[450,{"$f":"A62/50","v":9},{"$f":"IF(D62=\"\",\" - \",IF(LEN($A62)=3,C$60&$C$59&\"0\"&$A62,C$60&$C$59&$A62))","v":"RA113000450"},242,{"$f":"IF(F62=\"\",\" - \",IF(LEN($A62)=3,E$60&$C$59&\"0\"&$A62,E$60&$C$59&$A62))","v":"RA213000450"},339,{"$f":"IF(H62=\"\",\" - \",IF(LEN($A62)=3,G$60&$C$59&\"0\"&$A62,G$60&$C$59&$A62))","v":"RA223000450"},456,{"$f":"IF(J62=\"\",\" - \",IF(LEN($A62)=3,I$60&$C$59&\"0\"&$A62,I$60&$C$59&$A62))","v":"RA333000450"},638,{"$f":"IF(L62=\"\",\" - \",IF(LEN($A62)=3,K$60&$K$59&\"0\"&$A62,K$60&$K$59&$A62))","v":"RA114000450"},306,{"$f":"IF(N62=\"\",\" - \",IF(LEN($A62)=3,M$60&$K$59&\"0\"&$A62,M$60&$K$59&$A62))","v":"RA214000450"},421,{"$f":"IF(P62=\"\",\" - \",IF(LEN($A62)=3,O$60&$K$59&\"0\"&$A62,O$60&$K$59&$A62))","v":"RA224000450"},569,{"$f":"IF(R62=\"\",\" - \",IF(LEN($A62)=3,Q$60&$K$59&\"0\"&$A62,Q$60&$K$59&$A62))","v":"RA334000450"},809,{"$f":"IF(T62=\"\",\" - \",IF(LEN($A62)=3,S$60&$S$59&\"0\"&$A62,S$60&$S$59&$A62))","v":"RA115000450"},366,{"$f":"IF(V62=\"\",\" - \",IF(LEN($A62)=3,U$60&$S$59&\"0\"&$A62,U$60&$S$59&$A62))","v":"RA215000450"},498,{"$f":"IF(X62=\"\",\" - \",IF(LEN($A62)=3,W$60&$S$59&\"0\"&$A62,W$60&$S$59&$A62))","v":"RA225000450"},675,{"$f":"IF(Z62=\"\",\" - \",IF(LEN($A62)=3,Y$60&$S$59&\"0\"&$A62,Y$60&$S$59&$A62))","v":"RA335000450"},970]
[600,{"$f":"A63/50","v":12},"RA113000600",323,"RA213000600",453,"RA223000600",608,"RA333000600",850,"RA114000600",408,"RA214000600",561,"RA224000600",759,"RA334000600",1079,{"$f":"IF(T63=\"\",\" - \",IF(LEN($A63)=3,S$60&$S$59&\"0\"&$A63,S$60&$S$59&$A63))","v":"RA115000600"},489,"RA215000600",664,"RA225000600",900,"RA335000600",1293]
[750,15,"RA113000750",404,"RA213000750",566,"RA223000750",759,"RA333000750",1063,"RA114000750",510,"RA214000750",702,"RA224000750",949,"RA334000750",1349,"RA115000750",611,"RA215000750",830,"RA225000750",1124,"RA335000750",1616]
[900,18,"RA113000900",485,"RA213000900",679,"RA223000900",911,"RA333000900",1275,"RA114000900",612,"RA214000900",842,"RA224000900",1139,"RA334000900",1619,"RA115000900",733,"RA215000900",996,"RA225000900",1349,"RA335000900",1939]
[1050,21,"RA113001050",565,"RA213001050",792,"RA223001050",1063,"RA333001050",1488,"RA114001050",714,"RA214001050",983,"RA224001050",1328,"RA334001050",1889,"RA115001050",855,"RA215001050",1162,"RA225001050",1574,"RA335001050",2262]
[1200,24,"RA113001200",646,"RA213001200",905,"RA223001200",1215,"RA333001200",1701,"RA114001200",816,"RA214001200",1123,"RA224001200",1518,"RA334001200",2158,"RA115001200",977,"RA215001200",1328,"RA225001200",1799,"RA335001200",2586]
[1350,27,"RA113001350",727,"RA213001350",1018,"RA223001350",1367,"RA333001350",1913,"RA114001350",918,"RA214001350",1263,"RA224001350",1708,"RA334001350",2428,"RA115001350",1099,"RA215001350",1494,"RA225001350",2024,"RA335001350",2909]
[1500,30,"RA113001500",808,"RA213001500",1132,"RA223001500",1519,"RA333001500",2126,"RA114001500",1020,"RA214001500",1404,"RA224001500",1898,"RA334001500",2698,"RA115001500",1221,"RA215001500",1660,"RA225001500",2249,"RA335001500",3232]
[1650,33,"RA113001650",888,"RA213001650",1245,"RA223001650",1671,"RA333001650",2338,"RA114001650",1122,"RA214001650",1544,"RA224001650",2087,"RA334001650",2968,"RA115001650",1343,"RA215001650",1826,"RA225001650",2474,"RA335001650",3555]
[1800,36," - ",null,"RA213001800",1358,"RA223001800",1823,"RA333001800",2551," - ",null,"RA214001800",1684,"RA224001800",2277,"RA334001800",3237," - ",null,"RA215001800",1992,"RA225001800",2699,"RA335001800",3878]
[1950,39," - ",null,"RA213001950",1471,"RA223001950",1975,"RA333001950",2764," - ",null,"RA214001950",1825,"RA224001950",2467,"RA334001950",3507," - ",null,"RA215001950",2158,"RA225001950",2923,"RA335001950",4201]
[2100,42," - ",null,"RA213002100",1584,"RA223002100",2126,"RA333002100",2976," - ",null,"RA214002100",1965,"RA224002100",2657,"RA334002100",3777," - ",null,"RA215002100",2324,"RA225002100",3148,"RA335002100",4525]
[2250,45," - ",null,"RA213002250",1697,"RA223002250",2278,"RA333002250",3189," - ",null,"RA214002250",2106,"RA224002250",2846,"RA334002250",4047," - ",null,"RA215002250",2490,"RA225002250",3373,"RA335002250",4848]
[2400,48," - ",null,"RA213002400",1811,"RA223002400",2430,"RA333002400",3401," - ",null,"RA214002400",2246,"RA224002400",3036,"RA334002400",4317," - ",null,"RA215002400",2656,"RA225002400",3598,"RA335002400",5171]
[2550,51," - ",null,"RA213002550",1924,"RA223002550",2582,"RA333002550",3614," - ",null,"RA214002550",2386,"RA224002550",3226,"RA334002550",4586," - ",null,"RA215002550",2822,"RA225002550",3823,"RA335002550",5494]
[2700,54," - ",null,"RA213002700",2037,"RA223002700",2734,"RA333002700",3826," - ",null,"RA214002700",2527,"RA224002700",3416,"RA334002700",4856," - ",null,"RA215002700",2988,"RA225002700",4048,"RA335002700",5817]
[3000,60," - ",null,"RA213003000",2263,"RA223003000",3038,"RA333003000",4252," - ",null,"RA214003000",2807,"RA224003000",3795,"RA334003000",5396," - ",null,"RA215003000",3320,"RA225003000",4498,"RA335003000",6464]
[]
["PENTE :",null,1.3274999999999999,null,1.3434999999999999,null,1.3314999999999999,null,1.3412999999999999,null,1.3224,null,1.3584000000000001,null,1.3496999999999999,null,1.3595999999999999,null,1.3171999999999999,null,1.3732,null,1.3677999999999999,null,1.3778999999999999,null,null,null,null,null,null,null,null,null,null,null,null,null,null,null,null,null,null,1.3540000000000001]
["Hauteur",null,600,null,null,null,null,null,null,null,750,null,null,null,null,null,null,null,900]
["Type",null,"RA11",null,"RA21",null,"RA22",null,"RA33",null,"RA11",null,"RA21",null,"RA22",null,"RA33",null,"RA11",null,"RA21",null,"RA22",null,"RA33"]
["Longueur (mm)","Nombre éléments","Modèle","Watt \nDt 50°C","Modèle","Watt \nDt 50°C","Modèle","Watt \nDt 50°C","Modèle","Watt \nDt 50°C","Modèle","Watt \nDt 50°C","Modèle","Watt \nDt 50°C","Modèle","Watt \nDt 50°C","Modèle","Watt \nDt 50°C","Modèle",null,"Modèle","Watt \nDt 50°C","Modèle","Watt \nDt 50°C","Modèle","Watt \nDt 50°C"]
[450,{"$f":"A84/50","v":9},{"$f":"IF(D84=\"\",\" - \",IF(LEN($A62)=3,C$82&$C$81&\"0\"&$A62,C$82&$C$81&$A62))","v":"RA116000450"},424,{"$f":"IF(F84=\"\",\" - \",IF(LEN($A62)=3,E$82&$C$81&\"0\"&$A62,E$82&$C$81&$A62))","v":"RA216000450"},571,{"$f":"IF(H84=\"\",\" - \",IF(LEN($A62)=3,G$82&$C$81&\"0\"&$A62,G$82&$C$81&$A62))","v":"RA226000450"},773,{"$f":"IF(J84=\"\",\" - \",IF(LEN($A62)=3,I$82&$C$81&\"0\"&$A62,I$82&$C$81&$A62))","v":"RA336000450"},1120,{"$f":"IF(L84=\"\",\" - \",IF(LEN($A84)=3,K$82&$K$81&\"0\"&$A84,K$82&$K$81&$A84))","v":"RA117500450"},506,{"$f":"IF(N84=\"\",\" - \",IF(LEN($A84)=3,M$82&$K$81&\"0\"&$A84,M$82&$K$81&$A84))","v":"RA217500450"},676,{"$f":"IF(P84=\"\",\" - \",IF(LEN($A84)=3,O$82&$K$81&\"0\"&$A84,O$82&$K$81&$A84))","v":"RA227500450"},911,{"$f":"IF(R84=\"\",\" - \",IF(LEN($A84)=3,Q$82&$K$81&\"0\"&$A84,Q$82&$K$81&$A84))","v":"RA337500450"},1329,{"$f":"IF(T84=\"\",\" - \",IF(LEN($A84)=3,S$82&$S$81&\"0\"&$A84,S$82&$S$81&$A84))","v":"RA119000450"},584,{"$f":"IF(V84=\"\",\" - \",IF(LEN($A84)=3,U$82&$S$81&\"0\"&$A84,U$82&$S$81&$A84))","v":"RA219000450"},776,{"$f":"IF(X84=\"\",\" - \",IF(LEN($A84)=3,W$82&$S$81&\"0\"&$A84,W$82&$S$81&$A84))","v":"RA229000450"},1037,{"$f":"IF(Z84=\"\",\" - \",IF(LEN($A84)=3,Y$82&$S$81&\"0\"&$A84,Y$82&$S$81&$A84))","v":"RA339000450"},1521]
[600,{"$f":"A85/50","v":12},"RA116000600",565,"RA216000600",762,"RA226000600",1031,"RA336000600",1493,"RA117500600",675,"RA217500600",901,"RA227500600",1214,"RA337500600",1772,"RA119000600",779,"RA219000600",1034,"RA229000600",1383,"RA339000600",2028]
[750,15,"RA116000750",707,"RA216000750",952,"RA226000750",1289,"RA336000750",1867,"RA117500750",844,"RA217500750",1127,"RA227500750",1518,"RA337500750",2215,"RA119000750",974,"RA219000750",1293,"RA229000750",1729,"RA339000750",2535]
[900,18,"RA116000900",848,"RA216000900",1142,"RA226000900",1547,"RA336000900",2240,"RA117500900",1013,"RA217500900",1352,"RA227500900",1822,"RA337500900",2658,"RA119000900",1168,"RA219000900",1552,"RA229000900",2075,"RA339000900",3041]
[1050,21,"RA116001050",990,"RA216001050",1333,"RA226001050",1804,"RA336001050",2613,"RA117501050",1181,"RA217501050",1577,"RA227501050",2125,"RA337501050",3101,"RA119001050",1363,"RA219001050",1810,"RA229001050",2421,"RA339001050",3548]
[1200,24,"RA116001200",1131,"RA216001200",1523,"RA226001200",2062,"RA336001200",2987,"RA117501200",1350,"RA217501200",1802,"RA227501200",2429,"RA337501200",3544,"RA119001200",1558,"RA219001200",2069,"RA229001200",2766,"RA339001200",4055]
[1350,27,"RA116001350",1272,"RA216001350",1713,"RA226001350",2320,"RA336001350",3360,"RA117501350",1519,"RA217501350",2028,"RA227501350",2732,"RA337501350",3987,"RA119001350",1753,"RA219001350",2327,"RA229001350",3112,"RA339001350",4562]
[1500,30,"RA116001500",1414,"RA216001500",1904,"RA226001500",2578,"RA336001500",3733,"RA117501500",1688,"RA217501500",2253,"RA227501500",3036,"RA337501500",4430,"RA119001500",1947,"RA219001500",2586,"RA229001500",3458,"RA339001500",5069]
[1650,33,"RA116001650",1555,"RA216001650",2094,"RA226001650",2835,"RA336001650",4107,"RA117501650",1856,"RA217501650",2478,"RA227501650",3340,"RA337501650",4873,"RA119001650",2142,"RA219001650",2845,"RA229001650",3804,"RA339001650",5576]
[1800,36," - ",null,"RA216001800",2285,"RA226001800",3093,"RA336001800",4480," - ",null,"RA217501800",2704,"RA227501800",3643,"RA337501800",5316," - ",null,"RA219001800",3103,"RA229001800",4150,"RA339001800",6083]
[1950,39," - ",null,"RA216001950",2475,"RA226001950",3351,"RA336001950",4853," - ",null,"RA217501950",2929,"RA227501950",3947,"RA337501950",5759," - ",null,"RA219001950",3362,"RA229001950",4496,"RA339001950",6590]
[2100,42," - ",null,"RA216002100",2665,"RA226002100",3609,"RA336002100",5226," - ",null,"RA217502100",3154,"RA227502100",4250,"RA337502100",6202," - ",null,"RA219002100",3620,"RA229002100",4841,"RA339002100",7097]
[2250,45," - ",null,"RA216002250",2856,"RA226002250",3866,"RA336002250",5600," - ",null,"RA217502250",3380,"RA227502250",4554,"RA337502250",6645," - ",null,"RA219002250",3879,"RA229002250",5187,"RA339002250",7604]
[2400,48," - ",null,"RA216002400",3046,"RA226002400",4124,"RA336002400",5973," - ",null,"RA217502400",3605,"RA227502400",4858,"RA337502400",7088," - ",null,"RA219002400",4138,"RA229002400",5533,"RA339002400",8111]
[2550,51," - ",null,"RA216002550",3236,"RA226002550",4382,"RA336002550",6346," - ",null,"RA217502550",3830,"RA227502550",5161,"RA337502550",7531," - ",null,"RA219002550",4396,"RA229002550",5879,"RA339002550",8617]
[2700,54," - ",null,"RA216002700",3427,"RA226002700",4640,"RA336002700",6720," - ",null,"RA217502700",4055,"RA227502700",5465,"RA337502700",7974," - ",null,"RA219002700",4655,"RA229002700",6225,"RA339002700",9124]
[3000,60," - ",null,"RA216003000",3808,"RA226003000",5155,"RA336003000",7466," - ",null,"RA217503000",4506,"RA227503000",6072,"RA337503000",8860," - ",null,"RA219003000",5172,"RA229003000",6916,"RA339003000",10138]

{"sheet":"RAMO PLINTHE","index":12,"n_rows":88,"n_cols":26,"rows_kept":88,"cut":false,"hidden":false,"merged":[[2,2,2,6],[3,2,3,6],[4,2,4,6],[29,0,29,1],[29,2,29,7],[11,0,11,1],[11,2,11,3],[11,4,11,5],[11,6,11,7],[10,0,10,1],[10,2,10,7],[30,0,30,1],[30,2,30,3],[30,4,30,5],[30,6,30,7],[51,0,51,1],[51,2,51,3],[51,4,51,5],[51,6,51,7],[52,0,52,1],[52,2,52,7],[53,0,53,1],[53,2,53,3],[53,4,53,5],[53,6,53,7],[72,0,72,1],[72,2,72,3],[72,4,72,5],[72,6,72,7],[70,0,70,1],[70,2,70,3],[70,4,70,5],[70,6,70,7],[71,0,71,1],[71,2,71,7]]}
["Programme de calcul de la puissance thermique: RAMO PLINTHE et RAMO PLINTHE DOUBLE"]
[]
["Te",75,"<= Entrez la température à l'entrée en C°"]
["Ts",65,"<= Entrez la température à la sortie en C°"]
["Ti",20,"<= Entrez la température ambiante en C°"]
["Rapport",{"$f":"(B4-B5)/(B3-B5)","v":0.81818181818181823}]
["Delta T",{"$f":"((B3+B4)/2)-B5","v":50}]
["Delta T2",{"$f":"(B3-B4)/LN((B3-B5)/(B4-B5))","v":49.83288654563971},"Si Rapport < 0,7"]
[]
[]
["Hauteur",null,{"$f":"C53","v":200}]
["Type",null,{"$f":"C54","v":"RCV22"},null,{"$f":"E54","v":"RCV33"},null,{"$f":"G54","v":"RCV44"}]
["Longueur (mm)","Nombre éléments","Modèle","Puissance (watts)     ","Modèle","Puissance (watts)     ","Modèle","Puissance (watts)     "]
[{"$f":"A56","v":600},{"$f":"B56","v":12},{"$f":"C56","v":"RCV222000600"},{"$f":"IF(D56=\"\",\" - \",IF($B$6<0.7,D56*POWER($B$8/50,C$52),D56*POWER($B$7/50,C$52)))","v":434},{"$f":"E56","v":"RCV332000600"},{"$f":"IF(F56=\"\",\" - \",IF($B$6<0.7,F56*POWER($B$8/50,E$52),F56*POWER($B$7/50,E$52)))","v":628},{"$f":"G56","v":"RCV442000600"},{"$f":"IF(H56=\"\",\" - \",IF($B$6<0.7,H56*POWER($B$8/50,G$52),H56*POWER($B$7/50,G$52)))","v":803},null,null,null,null,null,null,null,null,null,null,null,null,null,","]
[{"$f":"A57","v":700},14,"RCV222000700",507,{"$f":"E57","v":"RCV332000700"},733,{"$f":"G57","v":"RCV442000700"},937]
[800,16,"RCV222000800",579,"RCV332000800",838,"RCV442000800",1071]
[900,18,"RCV222000900",652,"RCV332000900",942,"RCV442000900",1205]
[1000,20,"RCV222001000",724,"RCV332001000",1047,"RCV442001000",1339]
[1100,22,"RCV222001100",796,"RCV332001100",1152,"RCV442001100",1473]
[1200,24,"RCV222001200",869,"RCV332001200",1256,"RCV442001200",1607]
[1400,28,"RCV222001400",1014,"RCV332001400",1466,"RCV442001400",1875]
[1600,32,"RCV222001600",1158,"RCV332001600",1675,"RCV442001600",2142]
[1800,36,"RCV222001800",1303,"RCV332001800",1885,"RCV442001800",2410]
[2000,40,"RCV222002000",1448,"RCV332002000",2094,"RCV442002000",2678]
[2300,46,"RCV222002300",1665,"RCV332002300",2408,"RCV442002300",3080]
[2600,52,"RCV222002600",1882,"RCV332002600",2722,"RCV442002600",3481]
[3000,60,"RCV222003000",2172,"RCV332003000",3141,"RCV442003000",4017]
[]
[]
["Hauteur",null,{"$f":"C72","v":200}]
["Type",null,{"$f":"C73","v":"RRCV22"},null,{"$f":"E73","v":"RRCV33"},null,{"$f":"G73","v":"RRCV44"}]
["Longueur (mm)","Nombre éléments","Modèle","Puissance (watts)     ","Modèle","Puissance (watts)     ","Modèle","Puissance (watts)     "]
[{"$f":"A75","v":600},{"$f":"B75","v":12},{"$f":"C75","v":"RRCV222000600"},{"$f":"IF(D75=\"\",\" - \",IF($B$6<0.7,D75*POWER($B$8/50,C$71),D75*POWER($B$7/50,C$71)))","v":430},{"$f":"E75","v":"RRCV332000600"},{"$f":"IF(F75=\"\",\" - \",IF($B$6<0.7,F75*POWER($B$8/50,E$71),F75*POWER($B$7/50,E$71)))","v":598},{"$f":"G75","v":"RRCV442000600"},{"$f":"IF(H75=\"\",\" - \",IF($B$6<0.7,H75*POWER($B$8/50,G$71),H75*POWER($B$7/50,G$71)))","v":793}]
[{"$f":"A76","v":700},14,"RRCV222000700",502,"RRCV332000700",697,"RRCV442000700",925]
[800,16,"RRCV222000800",574,"RRCV332000800",797,"RRCV442000800",1057]
[900,18,"RRCV222000900",645,"RRCV332000900",896,"RRCV442000900",1189]
[1000,20,"RRCV222001000",717,"RRCV332001000",996,"RRCV442001000",1321]
[1100,22,"RRCV222001100",789,"RRCV332001100",1096,"RRCV442001100",1453]
[1200,24,"RRCV222001200",860,"RRCV332001200",1195,"RRCV442001200",1585]
[1400,28,"RRCV222001400",1004,"RRCV332001400",1394,"RRCV442001400",1849]
[1600,32,"RRCV222001600",1147,"RRCV332001600",1594,"RRCV442001600",2114]
[1800,36,"RRCV222001800",1291,"RRCV332001800",1793,"RRCV442001800",2378]
[2000,40,"RRCV222002000",1434,"RRCV332002000",1992,"RRCV442002000",2642]
[2300,46,"RRCV222002300",1649,"RRCV332002300",2291,"RRCV442002300",3038]
[2600,52,"RRCV222002600",1864,"RRCV332002600",2590,"RRCV442002600",3435]
[3000,60,"RRCV222003000",2151,"RRCV332003000",2988,"RRCV442003000",3963]
[]
[]
[]
["Tableau de référence"]
[]
["PENTE :",null,1.3238000000000001,null,1.3337000000000001,null,1.3432999999999999]
["Hauteur",null,200]
["Type",null,"RCV22",null,"RCV33",null,"RCV44"]
["Longueur (mm)","Nombre éléments","Modèle","Watt \nDt 50°C","Modèle","Watt \nDt 50°C","Modèle","Watt \nDt 50°C"]
[600,{"$f":"A56/50","v":12},{"$f":"IF(D56=\"\",\" - \",IF(LEN($A56)=3,C$54&$C$53&\"0\"&$A56,C$54&$C$53&$A56))","v":"RCV222000600"},434,{"$f":"IF(F56=\"\",\" - \",IF(LEN($A56)=3,E$54&$C$53&\"0\"&$A56,E$54&$C$53&$A56))","v":"RCV332000600"},628,{"$f":"IF(H56=\"\",\" - \",IF(LEN($A56)=3,G$54&$C$53&\"0\"&$A56,G$54&$C$53&$A56))","v":"RCV442000600"},803]
[700,{"$f":"A57/50","v":14},"RCV222000700",507,"RCV332000700",733,"RCV442000700",937]
[800,16,"RCV222000800",579,"RCV332000800",838,"RCV442000800",1071]
[900,18,"RCV222000900",652,"RCV332000900",942,"RCV442000900",1205]
[1000,20,"RCV222001000",724,"RCV332001000",1047,"RCV442001000",1339]
[1100,22,"RCV222001100",796,"RCV332001100",1152,"RCV442001100",1473]
[1200,24,"RCV222001200",869,"RCV332001200",1256,"RCV442001200",1607]
[1400,28,"RCV222001400",1014,"RCV332001400",1466,"RCV442001400",1875]
[1600,32,"RCV222001600",1158,"RCV332001600",1675,"RCV442001600",2142]
[1800,36,"RCV222001800",1303,"RCV332001800",1885,"RCV442001800",2410]
[2000,40,"RCV222002000",1448,"RCV332002000",2094,"RCV442002000",2678]
[2300,46,"RCV222002300",1665,"RCV332002300",2408,"RCV442002300",3080]
[2600,52,"RCV222002600",1882,"RCV332002600",2722,"RCV442002600",3481]
[3000,60,"RCV222003000",2172,"RCV332003000",3141,"RCV442003000",4017]
[]
["PENTE :",null,1.3176000000000001,null,1.3458000000000001,null,1.3395999999999999,null,null,null,null,null,null,null,null,null,null,null,null,null,null,null,null,null,null,1.3540000000000001]
["Hauteur",null,200]
["Type",null,"RRCV22",null,"RRCV33",null,"RRCV44"]
["Longueur (mm)","Nombre éléments","Modèle","Watt \nDt 50°C","Modèle","Watt \nDt 50°C","Modèle","Watt \nDt 50°C"]
[600,{"$f":"A75/50","v":12},{"$f":"IF(D75=\"\",\" - \",IF(LEN($A56)=3,C$73&$C$72&\"0\"&$A56,C$73&$C$72&$A56))","v":"RRCV222000600"},430,{"$f":"IF(F75=\"\",\" - \",IF(LEN($A56)=3,E$73&$C$72&\"0\"&$A56,E$73&$C$72&$A56))","v":"RRCV332000600"},598,{"$f":"IF(H75=\"\",\" - \",IF(LEN($A56)=3,G$73&$C$72&\"0\"&$A56,G$73&$C$72&$A56))","v":"RRCV442000600"},793]
[700,{"$f":"A76/50","v":14},"RRCV222000700",502,"RRCV332000700",697,"RRCV442000700",925]
[800,16,"RRCV222000800",574,"RRCV332000800",797,"RRCV442000800",1057]
[900,18,"RRCV222000900",645,"RRCV332000900",896,"RRCV442000900",1189]
[1000,20,"RRCV222001000",717,"RRCV332001000",996,"RRCV442001000",1321]
[1100,22,"RRCV222001100",789,"RRCV332001100",1096,"RRCV442001100",1453]
[1200,24,"RRCV222001200",860,"RRCV332001200",1195,"RRCV442001200",1585]
[1400,28,"RRCV222001400",1004,"RRCV332001400",1394,"RRCV442001400",1849]
[1600,32,"RRCV222001600",1147,"RRCV332001600",1594,"RRCV442001600",2114]
[1800,36,"RRCV222001800",1291,"RRCV332001800",1793,"RRCV442001800",2378]
[2000,40,"RRCV222002000",1434,"RRCV332002000",1992,"RRCV442002000",2642]
[2300,46,"RRCV222002300",1649,"RRCV332002300",2291,"RRCV442002300",3038]
[2600,52,"RRCV222002600",1864,"RRCV332002600",2590,"RRCV442002600",3435]
[3000,60,"RRCV222003000",2151,"RRCV332003000",2988,"RRCV442003000",3963]

{"sheet":"FARO H","index":13,"n_rows":76,"n_cols":36,"rows_kept":76,"cut":false,"hidden":false,"merged":[[10,10,10,17],[10,0,10,1],[10,2,10,9],[2,2,2,6],[3,2,3,6],[4,2,4,6],[26,0,26,1],[26,2,26,9],[26,10,26,17],[11,0,11,1],[11,2,11,3],[11,4,11,5],[11,6,11,7],[11,8,11,9],[11,10,11,11],[11,12,11,13],[11,14,11,15],[11,16,11,17],[27,12,27,13],[27,14,27,15],[27,16,27,17],[27,0,27,1],[27,2,27,3],[27,4,27,5],[27,6,27,7],[27,8,27,9],[27,10,27,11],[46,0,46,1],[46,2,46,9],[46,10,46,17],[45,0,45,1],[45,2,45,3],[45,4,45,5],[45,6,45,7],[45,8,45,9],[45,10,45,11],[45,12,45,13],[45,14,45,15],[45,16,45,17],[47,12,47,13],[47,14,47,15],[47,16,47,17],[47,0,47,1],[47,2,47,3],[47,4,47,5],[47,6,47,7],[47,8,47,9],[47,10,47,11],[62,0,62,1],[62,2,62,9],[62,10,62,17],[61,0,61,1],[61,2,61,3],[61,4,61,5],[61,6,61,7],[61,8,61,9],[61,10,61,11],[61,12,61,13],[61,14,61,15],[61,16,61,17],[63,12,63,13],[63,14,63,15],[63,16,63,17],[63,0,63,1],[63,2,63,3],[63,4,63,5],[63,6,63,7],[63,8,63,9],[63,10,63,11]]}
["Programme de calcul de la puissance thermique: FARO H"]
[]
["Te",75,"<= Entrez la température à l'entrée en C°"]
["Ts",65,"<= Entrez la température à la sortie en C°"]
["Ti",20,"<= Entrez la température ambiante en C°"]
["Rapport",{"$f":"(B4-B5)/(B3-B5)","v":0.81818181818181823}]
["Delta T",{"$f":"((B3+B4)/2)-B5","v":50}]
["Delta T2",{"$f":"(B3-B4)/LN((B3-B5)/(B4-B5))","v":49.83288654563971},"Si Rapport < 0,7"]
[]
[]
["Hauteur",null,{"$f":"C47","v":400},null,null,null,null,null,null,null,{"$f":"K47","v":600}]
["Type",null,{"$f":"C48","v":"FAH20"},null,{"$f":"E48","v":"FAH21"},null,{"$f":"G48","v":"FAH22"},null,{"$f":"I48","v":"FAH33"},null,{"$f":"K48","v":"FAH20"},null,{"$f":"M48","v":"FAH21"},null,{"$f":"O48","v":"FAH22"},null,{"$f":"Q48","v":"FAH33"}]
["Longueur (mm)","Nombre éléments","Modèle","Puissance (watts)     ","Modèle","Puissance (watts)     ","Modèle","Puissance (watts)     ","Modèle","Puissance (watts)     ","Modèle","Puissance (watts)     ","Modèle","Puissance (watts)     ","Modèle","Puissance (watts)     ","Modèle","Puissance (watts)     "]
[{"$f":"A50","v":450},{"$f":"B50","v":9},{"$f":"C50","v":"FAH204000450"},{"$f":"IF(D50=\"\",\" - \",IF($B$6<0.7,D50*POWER($B$8/50,C$46),D50*POWER($B$7/50,C$46)))","v":306},{"$f":"E50","v":"FAH214000450"},{"$f":"IF(F50=\"\",\" - \",IF($B$6<0.7,F50*POWER($B$8/50,E$46),F50*POWER($B$7/50,E$46)))","v":445},{"$f":"G50","v":"FAH224000450"},{"$f":"IF(H50=\"\",\" - \",IF($B$6<0.7,H50*POWER($B$8/50,G$46),H50*POWER($B$7/50,G$46)))","v":573},{"$f":"I50","v":"FAH334000450"},{"$f":"IF(J50=\"\",\" - \",IF($B$6<0.7,J50*POWER($B$8/50,I$46),J50*POWER($B$7/50,I$46)))","v":803},{"$f":"K50","v":"FAH206000450"},{"$f":"IF(L50=\"\",\" - \",IF($B$6<0.7,L50*POWER($B$8/50,K$46),L50*POWER($B$7/50,K$46)))","v":428},{"$f":"M50","v":"FAH216000450"},{"$f":"IF(N50=\"\",\" - \",IF($B$6<0.7,N50*POWER($B$8/50,M$46),N50*POWER($B$7/50,M$46)))","v":602},{"$f":"O50","v":"FAH226000450"},{"$f":"IF(P50=\"\",\" - \",IF($B$6<0.7,P50*POWER($B$8/50,O$46),P50*POWER($B$7/50,O$46)))","v":764},{"$f":"Q50","v":"FAH336000450"},{"$f":"IF(R50=\"\",\" - \",IF($B$6<0.7,R50*POWER($B$8/50,Q$46),R50*POWER($B$7/50,Q$46)))","v":1114},null,null,null,null,null,null,null,null,null,null,null,null,null,","]
[{"$f":"A51","v":600},12,"FAH204000600",407,{"$f":"E51","v":"FAH214000600"},593,{"$f":"G51","v":"FAH224000600"},764,{"$f":"I51","v":"FAH334000600"},1070,{"$f":"K51","v":"FAH206000600"},571,{"$f":"M51","v":"FAH216000600"},802,{"$f":"O51","v":"FAH226000600"},1018,{"$f":"Q51","v":"FAH336000600"},1485]
[750,15,"FAH204000750",509,"FAH214000750",742,"FAH224000750",955,"FAH334000750",1338,"FAH206000750",713,"FAH216000750",1003,"FAH226000750",1273,"FAH336000750",1856]
[900,18,"FAH204000900",611,"FAH214000900",890,"FAH224000900",1146,"FAH334000900",1606,"FAH206000900",856,"FAH216000900",1203,"FAH226000900",1528,"FAH336000900",2228]
[1050,21,"FAH204001050",713,"FAH214001050",1038,"FAH224001050",1337,"FAH334001050",1873,"FAH206001050",999,"FAH216001050",1404,"FAH226001050",1782,"FAH336001050",2599]
[1200,24,"FAH204001200",815,"FAH214001200",1187,"FAH224001200",1529,"FAH334001200",2141,"FAH206001200",1141,"FAH216001200",1604,"FAH226001200",2037,"FAH336001200",2970]
[1350,27,"FAH204001350",917,"FAH214001350",1335,"FAH224001350",1720,"FAH334001350",2408,"FAH206001350",1284,"FAH216001350",1805,"FAH226001350",2291,"FAH336001350",3341]
[1500,30,"FAH204001500",1019,"FAH214001500",1484,"FAH224001500",1911,"FAH334001500",2676,"FAH206001500",1427,"FAH216001500",2006,"FAH226001500",2546,"FAH336001500",3713]
[1650,33,"FAH204001650",1120,"FAH214001650",1632,"FAH224001650",2102,"FAH334001650",2944,"FAH206001650",1569,"FAH216001650",2206,"FAH226001650",2801,"FAH336001650",4084]
[1800,36,"FAH204001800",1222,"FAH214001800",1780,"FAH224001800",2293,"FAH334001800",3211,"FAH206001800",1712,"FAH216001800",2407,"FAH226001800",3055,"FAH336001800",4455]
[1950,39,"FAH204001950",1324,"FAH214001950",1929,"FAH224001950",2484,"FAH334001950",3479,"FAH206001950",1854,"FAH216001950",2607,"FAH226001950",3310,"FAH336001950",4826]
[]
[]
["Hauteur",null,{"$f":"C63","v":750},null,null,null,null,null,null,null,{"$f":"K63","v":900}]
["Type",null,{"$f":"C64","v":"FAH20"},null,{"$f":"E64","v":"FAH21"},null,{"$f":"G64","v":"FAH22"},null,{"$f":"I64","v":"FAH33"},null,{"$f":"K64","v":"FAH20"},null,{"$f":"M64","v":"FAH21"},null,{"$f":"O64","v":"FAH22"},null,{"$f":"Q64","v":"FAH33"}]
["Longueur (mm)","Nombre éléments","Modèle","Puissance (watts)     ","Modèle","Puissance (watts)     ","Modèle","Puissance (watts)     ","Modèle","Puissance (watts)     ","Modèle","Puissance (watts)     ","Modèle","Puissance (watts)     ","Modèle","Puissance (watts)     ","Modèle","Puissance (watts)     "]
[{"$f":"A66","v":450},{"$f":"B66","v":9},{"$f":"C66","v":"FAH207500450"},{"$f":"IF(D66=\"\",\" - \",IF($B$6<0.7,D66*POWER($B$8/50,C$62),D66*POWER($B$7/50,C$62)))","v":512},{"$f":"E66","v":"FAH217500450"},{"$f":"IF(F66=\"\",\" - \",IF($B$6<0.7,F66*POWER($B$8/50,E$62),F66*POWER($B$7/50,E$62)))","v":701},{"$f":"G66","v":"FAH227500450"},{"$f":"IF(H66=\"\",\" - \",IF($B$6<0.7,H66*POWER($B$8/50,G$62),H66*POWER($B$7/50,G$62)))","v":921},{"$f":"I66","v":"FAH337500450"},{"$f":"IF(J66=\"\",\" - \",IF($B$6<0.7,J66*POWER($B$8/50,I$62),J66*POWER($B$7/50,I$62)))","v":1309},{"$f":"K66","v":"FAH209000450"},{"$f":"IF(L66=\"\",\" - \",IF($B$6<0.7,L66*POWER($B$8/50,K$62),L66*POWER($B$7/50,K$62)))","v":590},{"$f":"M66","v":"FAH219000450"},{"$f":"IF(N66=\"\",\" - \",IF($B$6<0.7,N66*POWER($B$8/50,M$62),N66*POWER($B$7/50,M$62)))","v":802},{"$f":"O66","v":"FAH229000450"},{"$f":"IF(P66=\"\",\" - \",IF($B$6<0.7,P66*POWER($B$8/50,O$62),P66*POWER($B$7/50,O$62)))","v":1014},{"$f":"Q66","v":"FAH339000450"},{"$f":"IF(R66=\"\",\" - \",IF($B$6<0.7,R66*POWER($B$8/50,Q$62),R66*POWER($B$7/50,Q$62)))","v":1471}]
[{"$f":"A67","v":600},12,"FAH207500600",683,"FAH217500600",934,"FAH227500600",1229,"FAH337500600",1745,"FAH209000600",786,"FAH219000600",1070,"FAH229000600",1352,"FAH339000600",1961]
[750,15,"FAH207500750",854,"FAH217500750",1168,"FAH227500750",1536,"FAH337500750",2181,"FAH209000750",983,"FAH219000750",1337,"FAH229000750",1690,"FAH339000750",2451]
[900,18,"FAH207500900",1024,"FAH217500900",1401,"FAH227500900",1843,"FAH337500900",2617,"FAH209000900",1179,"FAH219000900",1605,"FAH229000900",2028,"FAH339000900",2941]
[1050,21,"FAH207501050",1195,"FAH217501050",1635,"FAH227501050",2150,"FAH337501050",3053,"FAH209001050",1376,"FAH219001050",1872,"FAH229001050",2366,"FAH339001050",3431]
[1200,24,"FAH207501200",1366,"FAH217501200",1868,"FAH227501200",2457,"FAH337501200",3490,"FAH209001200",1572,"FAH219001200",2140,"FAH229001200",2704,"FAH339001200",3922]
[1350,27,"FAH207501350",1536,"FAH217501350",2102,"FAH227501350",2764,"FAH337501350",3926,"FAH209001350",1769,"FAH219001350",2407,"FAH229001350",3042,"FAH339001350",4412]
[1500,30,"FAH207501500",1707,"FAH217501500",2336,"FAH227501500",3071,"FAH337501500",4362,"FAH209001500",1965,"FAH219001500",2675,"FAH229001500",3380,"FAH339001500",4902]
[1650,33," - "," - "," - "," - "," - "," - "," - "," - "," - "," - "," - "," - "," - "," - "," - "," - "]
[1800,36," - "," - "," - "," - "," - "," - "," - "," - "," - "," - "," - "," - "," - "," - "," - "," - "]
[1950,39," - "," - "," - "," - "," - "," - "," - "," - "," - "," - "," - "," - "," - "," - "," - "," - "]
[]
[]
[]
["Tableau de référence"]
[]
["PENTE :",null,1.2869999999999999,null,1.3261000000000001,null,1.3318000000000001,null,1.3222,null,1.2801,null,1.3310999999999999,null,1.3634999999999999,null,1.3539000000000001]
["Hauteur",null,400,null,null,null,null,null,null,null,600]
["Type",null,"FAH20",null,"FAH21",null,"FAH22",null,"FAH33",null,"FAH20",null,"FAH21",null,"FAH22",null,"FAH33"]
["Longueur (mm)","Nombre éléments","Modèle","Watt \nDt 50°C","Modèle","Watt \nDt 50°C","Modèle","Watt \nDt 50°C","Modèle","Watt \nDt 50°C","Modèle","Watt \nDt 50°C","Modèle","Watt \nDt 50°C","Modèle","Watt \nDt 50°C","Modèle","Watt \nDt 50°C"]
[450,{"$f":"A50/50","v":9},{"$f":"IF(D50=\"\",\" - \",IF(LEN($A50)=3,C$48&$C$47&\"0\"&$A50,C$48&$C$47&$A50))","v":"FAH204000450"},306,{"$f":"IF(F50=\"\",\" - \",IF(LEN($A50)=3,E$48&$C$47&\"0\"&$A50,E$48&$C$47&$A50))","v":"FAH214000450"},445,{"$f":"IF(H50=\"\",\" - \",IF(LEN($A50)=3,G$48&$C$47&\"0\"&$A50,G$48&$C$47&$A50))","v":"FAH224000450"},573,{"$f":"IF(J50=\"\",\" - \",IF(LEN($A50)=3,I$48&$C$47&\"0\"&$A50,I$48&$C$47&$A50))","v":"FAH334000450"},803,{"$f":"IF(L50=\"\",\" - \",IF(LEN($A50)=3,K$48&$K$47&\"0\"&$A50,K$48&$K$47&$A50))","v":"FAH206000450"},428,{"$f":"IF(N50=\"\",\" - \",IF(LEN($A50)=3,M$48&$K$47&\"0\"&$A50,M$48&$K$47&$A50))","v":"FAH216000450"},602,{"$f":"IF(P50=\"\",\" - \",IF(LEN($A50)=3,O$48&$K$47&\"0\"&$A50,O$48&$K$47&$A50))","v":"FAH226000450"},764,{"$f":"IF(R50=\"\",\" - \",IF(LEN($A50)=3,Q$48&$K$47&\"0\"&$A50,Q$48&$K$47&$A50))","v":"FAH336000450"},1114]
[600,{"$f":"A51/50","v":12},"FAH204000600",407,"FAH214000600",593,"FAH224000600",764,"FAH334000600",1070,"FAH206000600",571,"FAH216000600",802,"FAH226000600",1018,"FAH336000600",1485]
[750,15,"FAH204000750",509,"FAH214000750",742,"FAH224000750",955,"FAH334000750",1338,"FAH206000750",713,"FAH216000750",1003,"FAH226000750",1273,"FAH336000750",1856]
[900,18,"FAH204000900",611,"FAH214000900",890,"FAH224000900",1146,"FAH334000900",1606,"FAH206000900",856,"FAH216000900",1203,"FAH226000900",1528,"FAH336000900",2228]
[1050,21,"FAH204001050",713,"FAH214001050",1038,"FAH224001050",1337,"FAH334001050",1873,"FAH206001050",999,"FAH216001050",1404,"FAH226001050",1782,"FAH336001050",2599]
[1200,24,"FAH204001200",815,"FAH214001200",1187,"FAH224001200",1529,"FAH334001200",2141,"FAH206001200",1141,"FAH216001200",1604,"FAH226001200",2037,"FAH336001200",2970]
[1350,27,"FAH204001350",917,"FAH214001350",1335,"FAH224001350",1720,"FAH334001350",2408,"FAH206001350",1284,"FAH216001350",1805,"FAH226001350",2291,"FAH336001350",3341]
[1500,30,"FAH204001500",1019,"FAH214001500",1484,"FAH224001500",1911,"FAH334001500",2676,"FAH206001500",1427,"FAH216001500",2006,"FAH226001500",2546,"FAH336001500",3713]
[1650,33,"FAH204001650",1120,"FAH214001650",1632,"FAH224001650",2102,"FAH334001650",2944,"FAH206001650",1569,"FAH216001650",2206,"FAH226001650",2801,"FAH336001650",4084]
[1800,36,"FAH204001800",1222,"FAH214001800",1780,"FAH224001800",2293,"FAH334001800",3211,"FAH206001800",1712,"FAH216001800",2407,"FAH226001800",3055,"FAH336001800",4455]
[1950,39,"FAH204001950",1324,"FAH214001950",1929,"FAH224001950",2484,"FAH334001950",3479,"FAH206001950",1854,"FAH216001950",2607,"FAH226001950",3310,"FAH336001950",4826]
[]
["PENTE :",null,1.2811999999999999,null,1.3432999999999999,null,1.3607,null,1.3649,null,1.2823,null,1.3440000000000001,null,1.3896999999999999,null,1.3757999999999999,null,null,null,null,null,null,null,null,null,null,null,null,null,null,null,null,null,null,1.3540000000000001]
["Hauteur",null,750,null,null,null,null,null,null,null,900]
["Type",null,"FAH20",null,"FAH21",null,"FAH22",null,"FAH33",null,"FAH20",null,"FAH21",null,"FAH22",null,"FAH33"]
["Longueur (mm)","Nombre éléments","Modèle","Watt \nDt 50°C","Modèle","Watt \nDt 50°C","Modèle","Watt \nDt 50°C","Modèle","Watt \nDt 50°C","Modèle","Watt \nDt 50°C","Modèle","Watt \nDt 50°C","Modèle","Watt \nDt 50°C","Modèle","Watt \nDt 50°C"]
[450,{"$f":"A66/50","v":9},{"$f":"IF(D66=\"\",\" - \",IF(LEN($A50)=3,C$64&$C$63&\"0\"&$A50,C$64&$C$63&$A50))","v":"FAH207500450"},512,{"$f":"IF(F66=\"\",\" - \",IF(LEN($A50)=3,E$64&$C$63&\"0\"&$A50,E$64&$C$63&$A50))","v":"FAH217500450"},701,{"$f":"IF(H66=\"\",\" - \",IF(LEN($A50)=3,G$64&$C$63&\"0\"&$A50,G$64&$C$63&$A50))","v":"FAH227500450"},921,{"$f":"IF(J66=\"\",\" - \",IF(LEN($A50)=3,I$64&$C$63&\"0\"&$A50,I$64&$C$63&$A50))","v":"FAH337500450"},1309,{"$f":"IF(L66=\"\",\" - \",IF(LEN($A66)=3,K$64&$K$63&\"0\"&$A66,K$64&$K$63&$A66))","v":"FAH209000450"},590,{"$f":"IF(N66=\"\",\" - \",IF(LEN($A66)=3,M$64&$K$63&\"0\"&$A66,M$64&$K$63&$A66))","v":"FAH219000450"},802,{"$f":"IF(P66=\"\",\" - \",IF(LEN($A66)=3,O$64&$K$63&\"0\"&$A66,O$64&$K$63&$A66))","v":"FAH229000450"},1014,{"$f":"IF(R66=\"\",\" - \",IF(LEN($A66)=3,Q$64&$K$63&\"0\"&$A66,Q$64&$K$63&$A66))","v":"FAH339000450"},1471]
[600,{"$f":"A67/50","v":12},"FAH207500600",683,"FAH217500600",934,"FAH227500600",1229,"FAH337500600",1745,"FAH209000600",786,"FAH219000600",1070,"FAH229000600",1352,"FAH339000600",1961]
[750,15,"FAH207500750",854,"FAH217500750",1168,"FAH227500750",1536,"FAH337500750",2181,"FAH209000750",983,"FAH219000750",1337,"FAH229000750",1690,"FAH339000750",2451]
[900,18,"FAH207500900",1024,"FAH217500900",1401,"FAH227500900",1843,"FAH337500900",2617,"FAH209000900",1179,"FAH219000900",1605,"FAH229000900",2028,"FAH339000900",2941]
[1050,21,"FAH207501050",1195,"FAH217501050",1635,"FAH227501050",2150,"FAH337501050",3053,"FAH209001050",1376,"FAH219001050",1872,"FAH229001050",2366,"FAH339001050",3431]
[1200,24,"FAH207501200",1366,"FAH217501200",1868,"FAH227501200",2457,"FAH337501200",3490,"FAH209001200",1572,"FAH219001200",2140,"FAH229001200",2704,"FAH339001200",3922]
[1350,27,"FAH207501350",1536,"FAH217501350",2102,"FAH227501350",2764,"FAH337501350",3926,"FAH209001350",1769,"FAH219001350",2407,"FAH229001350",3042,"FAH339001350",4412]
[1500,30,"FAH207501500",1707,"FAH217501500",2336,"FAH227501500",3071,"FAH337501500",4362,"FAH209001500",1965,"FAH219001500",2675,"FAH229001500",3380,"FAH339001500",4902]
[1650,33," - ",null," - ",null," - ",null," - ",null," - ",null," - ",null," - ",null," - "]
[1800,36," - ",null," - ",null," - ",null," - ",null," - ",null," - ",null," - ",null," - "]
[1950,39," - ",null," - ",null," - ",null," - ",null," - ",null," - ",null," - ",null," - "]

{"sheet":"FARO V","index":14,"n_rows":69,"n_cols":22,"rows_kept":69,"cut":false,"hidden":false,"merged":[[63,0,63,1],[52,6,52,7],[52,4,52,5],[51,0,51,1],[52,0,52,1],[62,0,62,1],[10,0,10,1],[10,2,10,7],[10,8,10,13],[42,14,42,16],[42,17,42,19],[11,10,11,11],[11,12,11,13],[20,10,20,11],[20,12,20,13],[41,10,41,11],[41,12,41,13],[41,8,41,9],[19,0,19,1],[19,2,19,7],[19,8,19,13],[11,0,11,1],[11,2,11,3],[11,4,11,5],[11,6,11,7],[11,8,11,9],[43,8,43,9],[43,10,43,11],[43,12,43,13],[20,0,20,1],[20,2,20,3],[20,4,20,5],[20,6,20,7],[41,0,41,1],[41,2,41,3],[41,4,41,5],[41,6,41,7],[51,14,51,16],[51,17,51,19],[52,10,52,11],[52,12,52,13],[52,2,52,3],[52,8,52,9],[51,2,51,7],[51,8,51,13],[64,0,64,1],[64,2,64,3],[64,4,64,5],[64,6,64,7],[30,0,30,1],[31,0,31,1],[31,2,31,3],[31,4,31,5],[31,6,31,7],[50,0,50,1],[50,2,50,3],[50,4,50,5],[50,6,50,7],[42,0,42,1],[42,2,42,7],[43,0,43,1],[62,8,62,10],[63,2,63,3],[63,4,63,5],[63,6,63,7],[62,2,62,3],[62,4,62,5],[62,6,62,7],[41,14,41,19],[50,14,50,19],[2,2,2,6],[3,2,3,6],[4,2,4,6],[30,2,30,3],[30,4,30,5],[30,6,30,7],[20,8,20,9],[50,10,50,11],[50,12,50,13],[50,8,50,9],[42,8,42,13],[43,2,43,3],[43,4,43,5],[43,6,43,7]]}
["Programme de calcul de la puissance thermique: FARO V"]
[]
["Te",75,"<= Entrez la température à l'entrée en C°"]
["Ts",65,"<= Entrez la température à la sortie en C°"]
["Ti",20,"<= Entrez la température ambiante en C°"]
["Rapport",{"$f":"(B4-B5)/(B3-B5)","v":0.81818181818181823}]
["Delta T",{"$f":"((B3+B4)/2)-B5","v":50}]
["Delta T2",{"$f":"(B3-B4)/LN((B3-B5)/(B4-B5))","v":49.83288654563971},"Si Rapport < 0,7"]
[]
[]
["Hauteur",null,{"$f":"C43","v":1500},null,null,null,null,null,{"$f":"I43","v":1800}]
["Type",null,{"$f":"C44","v":"FAV20"},null,{"$f":"E44","v":"FAV21"},null,{"$f":"G44","v":"FAV22"},null,{"$f":"I44","v":"FAV20"},null,{"$f":"K44","v":"FAV21"},null,{"$f":"M44","v":"FAV22"}]
["Longueur (mm)","Nombre éléments","Modèle","Puissance (watts)     ","Modèle","Puissance (watts)     ","Modèle","Puissance (watts)     ","Modèle","Puissance (watts)     ","Modèle","Puissance (watts)     ","Modèle","Puissance (watts)     "]
[{"$f":"A46","v":300},{"$f":"B46","v":6},{"$f":"C46","v":" - "},{"$f":"IF(D46=\"\",\" - \",IF($B$6<0.7,D46*POWER($B$8/50,O46),D46*POWER($B$7/50,O46)))","v":" - "},{"$f":"E46","v":"FAV211500300"},{"$f":"IF(F46=\"\",\" - \",IF($B$6<0.7,F46*POWER($B$8/50,P46),F46*POWER($B$7/50,P46)))","v":850},{"$f":"G46","v":"FAV221500300"},{"$f":"IF(H46=\"\",\" - \",IF($B$6<0.7,H46*POWER($B$8/50,Q46),H46*POWER($B$7/50,Q46)))","v":992},{"$f":"I46","v":"FAV201800300"},{"$f":"IF(J46=\"\",\" - \",IF($B$6<0.7,J46*POWER($B$8/50,R46),J46*POWER($B$7/50,R46)))","v":846},{"$f":"K46","v":"FAV211800300"},{"$f":"IF(L46=\"\",\" - \",IF($B$6<0.7,L46*POWER($B$8/50,S46),L46*POWER($B$7/50,S46)))","v":886},{"$f":"M46","v":"FAV221800300"},{"$f":"IF(N46=\"\",\" - \",IF($B$6<0.7,N46*POWER($B$8/50,T46),N46*POWER($B$7/50,T46)))","v":1046},null,null,null,null,null,null,null,","]
[{"$f":"A47","v":450},9,{"$f":"C47","v":" - "},{"$f":"IF(D47=\"\",\" - \",IF($B$6<0.7,D47*POWER($B$8/50,O47),D47*POWER($B$7/50,O47)))","v":" - "},{"$f":"E47","v":"FAV211500450"},{"$f":"IF(F47=\"\",\" - \",IF($B$6<0.7,F47*POWER($B$8/50,P47),F47*POWER($B$7/50,P47)))","v":1206},{"$f":"G47","v":"FAV221500450"},{"$f":"IF(H47=\"\",\" - \",IF($B$6<0.7,H47*POWER($B$8/50,Q47),H47*POWER($B$7/50,Q47)))","v":1436},{"$f":"I47","v":"FAV201800450"},{"$f":"IF(J47=\"\",\" - \",IF($B$6<0.7,J47*POWER($B$8/50,R47),J47*POWER($B$7/50,R47)))","v":1152},{"$f":"K47","v":"FAV211800450"},{"$f":"IF(L47=\"\",\" - \",IF($B$6<0.7,L47*POWER($B$8/50,S47),L47*POWER($B$7/50,S47)))","v":1329},{"$f":"M47","v":"FAV221800450"},{"$f":"IF(N47=\"\",\" - \",IF($B$6<0.7,N47*POWER($B$8/50,T47),N47*POWER($B$7/50,T47)))","v":1569}]
[600,12,{"$f":"C48","v":" - "}," - ","FAV211500600",1563,"FAV221500600",1880,"FAV201800600",1459,"FAV211800600",1772,"FAV221800600",2092]
[750,15,{"$f":"C49","v":" - "}," - "," - "," - "," - "," - "," - "," - ","FAV211800750",2215,"FAV221800750",2615]
[]
[]
["Hauteur",null,{"$f":"C52","v":1950},null,null,null,null,null,{"$f":"I52","v":2100}]
["Type",null,{"$f":"C53","v":"FAV20"},null,{"$f":"E53","v":"FAV21"},null,{"$f":"G53","v":"FAV22"},null,{"$f":"I53","v":"FAV20"},null,{"$f":"K53","v":"FAV21"},null,{"$f":"M53","v":"FAV22"}]
["Longueur (mm)","Nombre éléments","Modèle","Puissance (watts)     ","Modèle","Puissance (watts)     ","Modèle","Puissance (watts)     ","Modèle","Puissance (watts)     ","Modèle","Puissance (watts)     ","Modèle","Puissance (watts)     "]
[{"$f":"A55","v":300},{"$f":"B55","v":6},{"$f":"C55","v":"FAV201950300"},{"$f":"IF(D55=\"\",\" - \",IF($B$6<0.7,D55*POWER($B$8/50,O55),D55*POWER($B$7/50,O55)))","v":927},{"$f":"E55","v":"FAV211950300"},{"$f":"IF(F55=\"\",\" - \",IF($B$6<0.7,F55*POWER($B$8/50,P55),F55*POWER($B$7/50,P55)))","v":936},{"$f":"G55","v":"FAV221950300"},{"$f":"IF(H55=\"\",\" - \",IF($B$6<0.7,H55*POWER($B$8/50,Q55),H55*POWER($B$7/50,Q55)))","v":1103},{"$f":"I55","v":"FAV202100300"},{"$f":"IF(J55=\"\",\" - \",IF($B$6<0.7,J55*POWER($B$8/50,R55),J55*POWER($B$7/50,R55)))","v":975},{"$f":"K55","v":"FAV212100300"},{"$f":"IF(L55=\"\",\" - \",IF($B$6<0.7,L55*POWER($B$8/50,S55),L55*POWER($B$7/50,S55)))","v":978},{"$f":"M55","v":"FAV222100300"},{"$f":"IF(N55=\"\",\" - \",IF($B$6<0.7,N55*POWER($B$8/50,T55),N55*POWER($B$7/50,T55)))","v":1161}]
[{"$f":"A56","v":450},9,{"$f":"C56","v":"FAV201950450"},{"$f":"IF(D56=\"\",\" - \",IF($B$6<0.7,D56*POWER($B$8/50,O56),D56*POWER($B$7/50,O56)))","v":1241},"FAV211950450",{"$f":"IF(F56=\"\",\" - \",IF($B$6<0.7,F56*POWER($B$8/50,P56),F56*POWER($B$7/50,P56)))","v":1405},"FAV221950450",{"$f":"IF(H56=\"\",\" - \",IF($B$6<0.7,H56*POWER($B$8/50,Q56),H56*POWER($B$7/50,Q56)))","v":1654},"FAV202100450",{"$f":"IF(J56=\"\",\" - \",IF($B$6<0.7,J56*POWER($B$8/50,R56),J56*POWER($B$7/50,R56)))","v":1310},"FAV212100450",{"$f":"IF(L56=\"\",\" - \",IF($B$6<0.7,L56*POWER($B$8/50,S56),L56*POWER($B$7/50,S56)))","v":1468},"FAV222100450",{"$f":"IF(N56=\"\",\" - \",IF($B$6<0.7,N56*POWER($B$8/50,T56),N56*POWER($B$7/50,T56)))","v":1742}]
[600,12,{"$f":"C57","v":"FAV201950600"},1554,"FAV211950600",1873,"FAV221950600",2205,"FAV202100600",1644,"FAV212100600",1957,"FAV222100600",2323]
[750,15,{"$f":"C58","v":"FAV201950750"},1868,"FAV211950750",2341,"FAV221950750",{"$f":"IF(H58=\"\",\" - \",IF($B$6<0.7,H58*POWER($B$8/50,Q58),H58*POWER($B$7/50,Q58)))","v":2756},"FAV202100750",1979,"FAV212100750",2446,"FAV222100750",2903]
[]
[]
["FARO V INOX"]
[]
["Hauteur",null,1800,null,1950,null,2100]
["Type",null,{"$f":"C65","v":"FAV21"},null,{"$f":"E65","v":"FAV21"},null,{"$f":"G65","v":"FAV21"}]
["Longueur (mm)","Nombre éléments","Modèle","Puissance (watts)     ","Modèle","Puissance (watts)     ","Modèle","Puissance (watts)     "]
[{"$f":"A67","v":450},{"$f":"B67","v":9},{"$f":"C67","v":"FAV211800450I"},{"$f":"IF(D67=\"\",\" - \",IF($B$6<0.7,D67*POWER($B$8/50,I67),D67*POWER($B$7/50,I67)))","v":1183},{"$f":"E67","v":" - "},{"$f":"IF(F67=\"\",\" - \",IF($B$6<0.7,F67*POWER($B$8/50,J67),F67*POWER($B$7/50,J67)))","v":" - "},{"$f":"G67","v":" - "},{"$f":"IF(H67=\"\",\" - \",IF($B$6<0.7,H67*POWER($B$8/50,K67),H67*POWER($B$7/50,K67)))","v":" - "}]
[{"$f":"A68","v":600},12,{"$f":"C68","v":" - "},{"$f":"IF(D68=\"\",\" - \",IF($B$6<0.7,D68*POWER($B$8/50,I68),D68*POWER($B$7/50,I68)))","v":" - "},"FAV211950600I",{"$f":"IF(F68=\"\",\" - \",IF($B$6<0.7,F68*POWER($B$8/50,J68),F68*POWER($B$7/50,J68)))","v":1601}," - ",{"$f":"IF(H68=\"\",\" - \",IF($B$6<0.7,H68*POWER($B$8/50,K68),H68*POWER($B$7/50,K68)))","v":" - "}]
[{"$f":"A69","v":750},15,{"$f":"C69","v":" - "}," - "," - "," - ","FAV212100750I",{"$f":"IF(H69=\"\",\" - \",IF($B$6<0.7,H69*POWER($B$8/50,K69),H69*POWER($B$7/50,K69)))","v":2095}]
[]
[]
[]
["Tableau de référence"]
[]
["PENTE :",null,null,null,null,null,null,null,null,null,null,null,null,null,"PENTE"]
["Hauteur",null,1500,null,null,null,null,null,1800,null,null,null,null,null,1500,null,null,1800]
["Type",null,"FAV20",null,"FAV21",null,"FAV22",null,"FAV20",null,"FAV21",null,"FAV22",null,"FAV20","FAV21","FAV22","FAV20","FAV21","FAV22"]
["Longueur (mm)","Nombre éléments","Modèle","Watt \nDt 50°C","Modèle","Watt \nDt 50°C","Modèle","Watt \nDt 50°C","Modèle","Watt \nDt 50°C","Modèle","Watt \nDt 50°C","Modèle","Watt \nDt 50°C"]
[300,{"$f":"A46/50","v":6},{"$f":"IF(D46=\"\",\" - \",C$44&$C$43&$A46)","v":" - "},null,{"$f":"IF(F46=\"\",\" - \",E$44&$C$43&$A46)","v":"FAV211500300"},850,{"$f":"IF(H46=\"\",\" - \",G$44&$C$43&$A46)","v":"FAV221500300"},992,{"$f":"IF(J46=\"\",\" - \",I$44&$I$43&$A46)","v":"FAV201800300"},846,{"$f":"IF(L46=\"\",\" - \",K$44&$I$43&$A46)","v":"FAV211800300"},886,{"$f":"IF(N46=\"\",\" - \",M$44&$I$43&$A46)","v":"FAV221800300"},1046,null,1.3218000000000001,1.3038000000000001,1.2745,1.3191999999999999,1.3387]
[450,{"$f":"A47/50","v":9},{"$f":"IF(D47=\"\",\" - \",C$44&$C$43&$A47)","v":" - "},null,{"$f":"IF(F47=\"\",\" - \",E$44&$C$43&$A47)","v":"FAV211500450"},1206,{"$f":"IF(H47=\"\",\" - \",G$44&$C$43&$A47)","v":"FAV221500450"},1436,{"$f":"IF(J47=\"\",\" - \",I$44&$I$43&$A47)","v":"FAV201800450"},1152,{"$f":"IF(L47=\"\",\" - \",K$44&$I$43&$A47)","v":"FAV211800450"},1329,{"$f":"IF(N47=\"\",\" - \",M$44&$I$43&$A47)","v":"FAV221800450"},1569,null,1.3184,1.3140000000000001,1.2735000000000001,1.3191999999999999,1.3387]
[600,12,{"$f":"IF(D48=\"\",\" - \",C$44&$C$43&$A48)","v":" - "},null,{"$f":"IF(F48=\"\",\" - \",E$44&$C$43&$A48)","v":"FAV211500600"},1563,{"$f":"IF(H48=\"\",\" - \",G$44&$C$43&$A48)","v":"FAV221500600"},1880,{"$f":"IF(J48=\"\",\" - \",I$44&$I$43&$A48)","v":"FAV201800600"},1459,{"$f":"IF(L48=\"\",\" - \",K$44&$I$43&$A48)","v":"FAV211800600"},1772,{"$f":"IF(N48=\"\",\" - \",M$44&$I$43&$A48)","v":"FAV221800600"},2092,null,1.3149999999999999,1.3241000000000001,1.2726,1.3191999999999999,1.3387]
[750,15,{"$f":"IF(D49=\"\",\" - \",C$44&$C$43&$A49)","v":" - "},null,{"$f":"IF(F49=\"\",\" - \",E$44&$C$43&$A49)","v":" - "},null,{"$f":"IF(H49=\"\",\" - \",G$44&$C$43&$A49)","v":" - "},null,{"$f":"IF(J49=\"\",\" - \",I$44&$I$43&$A49)","v":" - "},null,{"$f":"IF(L49=\"\",\" - \",K$44&$I$43&$A49)","v":"FAV211800750"},2215,{"$f":"IF(N49=\"\",\" - \",M$44&$I$43&$A49)","v":"FAV221800750"},2615,null,null,null,null,1.3191999999999999,1.3387]
[]
["PENTE :"]
["Hauteur",null,1950,null,null,null,null,null,2100,null,null,null,null,null,1950,null,null,2100]
["Type",null,"FAV20",null,"FAV21",null,"FAV22",null,"FAV20",null,"FAV21",null,"FAV22",null,"FAV20","FAV21","FAV22","FAV20","FAV21","FAV22"]
["Longueur (mm)","Nombre éléments","Modèle","Watt \nDt 50°C","Modèle","Watt \nDt 50°C","Modèle","Watt \nDt 50°C","Modèle","Watt \nDt 50°C","Modèle","Watt \nDt 50°C","Modèle","Watt \nDt 50°C"]
[300,{"$f":"A55/50","v":6},{"$f":"IF(D55=\"\",\" - \",C$53&$C$52&$A55)","v":"FAV201950300"},927,{"$f":"IF(F55=\"\",\" - \",E$53&$C$52&$A55)","v":"FAV211950300"},936,{"$f":"IF(H55=\"\",\" - \",G$53&$C$52&$A55)","v":"FAV221950300"},1103,{"$f":"IF(J55=\"\",\" - \",I$53&$I$52&$A55)","v":"FAV202100300"},975,{"$f":"IF(L55=\"\",\" - \",K$53&$I$52&$A55)","v":"FAV212100300"},978,{"$f":"IF(N55=\"\",\" - \",M$53&$I$52&$A55)","v":"FAV222100300"},1161,1.3026,1.3230999999999999,1.4255,1.2952999999999999,1.3327,1.3343]
[450,{"$f":"A56/50","v":9},{"$f":"IF(D56=\"\",\" - \",C$53&$C$52&$A56)","v":"FAV201950450"},1241,{"$f":"IF(F56=\"\",\" - \",E$53&$C$52&$A56)","v":"FAV211950450"},1405,{"$f":"IF(H56=\"\",\" - \",G$53&$C$52&$A56)","v":"FAV221950450"},1654,{"$f":"IF(J56=\"\",\" - \",I$53&$I$52&$A56)","v":"FAV202100450"},1310,{"$f":"IF(L56=\"\",\" - \",K$53&$I$52&$A56)","v":"FAV212100450"},1468,{"$f":"IF(N56=\"\",\" - \",M$53&$I$52&$A56)","v":"FAV222100450"},1742,1.2965,1.3230999999999999,1.4255,1.2887,1.3327,1.3343]
[600,12,{"$f":"IF(D57=\"\",\" - \",C$53&$C$52&$A57)","v":"FAV201950600"},1554,{"$f":"IF(F57=\"\",\" - \",E$53&$C$52&$A57)","v":"FAV211950600"},1873,{"$f":"IF(H57=\"\",\" - \",G$53&$C$52&$A57)","v":"FAV221950600"},2205,{"$f":"IF(J57=\"\",\" - \",I$53&$I$52&$A57)","v":"FAV202100600"},1644,{"$f":"IF(L57=\"\",\" - \",K$53&$I$52&$A57)","v":"FAV212100600"},1957,{"$f":"IF(N57=\"\",\" - \",M$53&$I$52&$A57)","v":"FAV222100600"},2323,1.2903,1.3230999999999999,1.4255,1.2822,1.3327,1.3343]
[750,15,{"$f":"IF(D58=\"\",\" - \",C$53&$C$52&$A58)","v":"FAV201950750"},1868,{"$f":"IF(F58=\"\",\" - \",E$53&$C$52&$A58)","v":"FAV211950750"},2341,{"$f":"IF(H58=\"\",\" - \",G$53&$C$52&$A58)","v":"FAV221950750"},2756,{"$f":"IF(J58=\"\",\" - \",I$53&$I$52&$A58)","v":"FAV202100750"},1979,{"$f":"IF(L58=\"\",\" - \",K$53&$I$52&$A58)","v":"FAV212100750"},2446,{"$f":"IF(N58=\"\",\" - \",M$53&$I$52&$A58)","v":"FAV222100750"},2903,1.2842,1.3230999999999999,1.4255,1.2756000000000001,1.3327,1.3343]
[]
[]
["FARO V INOX"]
[]
["PENTE :",null,null,null,null,null,null,null,"PENTE"]
["Hauteur",null,1800,null,1950,null,2100,null,1800,1950,2100]
["Type",null,"FAV21",null,"FAV21",null,"FAV21",null,"FAV21","FAV21","FAV21"]
["Longueur (mm)","Nombre éléments","Modèle","Watt \nDt 50°C","Modèle","Watt \nDt 50°C","Modèle","Watt \nDt 50°C"]
[450,{"$f":"A67/50","v":9},{"$f":"IF(D67=\"\",\" - \",C$65&$C$64&$A67&\"I\")","v":"FAV211800450I"},1183,{"$f":"IF(F67=\"\",\" - \",E$65&$E$64&$A67&\"I\")","v":" - "},null,{"$f":"IF(H67=\"\",\" - \",G$65&$G$64&$A67&\"I\")","v":" - "},null,1.3308]
[600,{"$f":"A68/50","v":12},{"$f":"IF(D68=\"\",\" - \",C$65&$C$64&$A68&\"I\")","v":" - "},null,{"$f":"IF(F68=\"\",\" - \",E$65&$E$64&$A68&\"I\")","v":"FAV211950600I"},1601,{"$f":"IF(H68=\"\",\" - \",G$65&$G$64&$A68&\"I\")","v":" - "},null,null,1.36]
[750,15,{"$f":"IF(D69=\"\",\" - \",C$65&$C$64&$A69&\"I\")","v":" - "},null,{"$f":"IF(F69=\"\",\" - \",E$65&$E$64&$A69&\"I\")","v":" - "},null,{"$f":"IF(H69=\"\",\" - \",G$65&$G$64&$A69&\"I\")","v":"FAV212100750I"},2095,null,null,1.3693]

{"sheet":"KOS H","index":15,"n_rows":76,"n_cols":36,"rows_kept":76,"cut":false,"hidden":false,"merged":[[10,10,10,17],[10,0,10,1],[10,2,10,9],[2,2,2,6],[3,2,3,6],[4,2,4,6],[11,12,11,13],[11,14,11,15],[11,16,11,17],[26,0,26,1],[26,2,26,9],[26,10,26,17],[11,0,11,1],[11,2,11,3],[11,4,11,5],[11,6,11,7],[11,8,11,9],[11,10,11,11],[27,12,27,13],[27,14,27,15],[27,16,27,17],[45,0,45,1],[45,2,45,3],[45,4,45,5],[45,6,45,7],[45,8,45,9],[45,10,45,11],[45,12,45,13],[27,0,27,1],[27,2,27,3],[27,4,27,5],[27,6,27,7],[27,8,27,9],[27,10,27,11],[45,14,45,15],[45,16,45,17],[46,0,46,1],[46,2,46,9],[46,10,46,17],[47,10,47,11],[47,12,47,13],[47,14,47,15],[47,16,47,17],[61,0,61,1],[61,2,61,3],[61,4,61,5],[61,6,61,7],[61,8,61,9],[61,10,61,11],[47,0,47,1],[47,2,47,3],[47,4,47,5],[47,6,47,7],[47,8,47,9],[61,12,61,13],[61,14,61,15],[61,16,61,17],[62,0,62,1],[62,2,62,9],[62,10,62,17],[63,12,63,13],[63,14,63,15],[63,16,63,17],[63,0,63,1],[63,2,63,3],[63,4,63,5],[63,6,63,7],[63,8,63,9],[63,10,63,11]]}
["Programme de calcul de la puissance thermique: KOS H"]
[]
["Te",75,"<= Entrez la température à l'entrée en C°"]
["Ts",65,"<= Entrez la température à la sortie en C°"]
["Ti",20,"<= Entrez la température ambiante en C°"]
["Rapport",{"$f":"(B4-B5)/(B3-B5)","v":0.81818181818181823}]
["Delta T",{"$f":"((B3+B4)/2)-B5","v":50}]
["Delta T2",{"$f":"(B3-B4)/LN((B3-B5)/(B4-B5))","v":49.83288654563971},"Si Rapport < 0,7"]
[]
[]
["Hauteur",null,{"$f":"C47","v":400},null,null,null,null,null,null,null,{"$f":"K47","v":600}]
["Type",null,{"$f":"C48","v":"KOH20"},null,{"$f":"E48","v":"KOH21"},null,{"$f":"G48","v":"KOH22"},null,{"$f":"I48","v":"KOH33"},null,{"$f":"K48","v":"KOH20"},null,{"$f":"M48","v":"KOH21"},null,{"$f":"O48","v":"KOH22"},null,{"$f":"Q48","v":"KOH33"}]
["Longueur (mm)","Nombre éléments","Modèle","Puissance (watts)     ","Modèle","Puissance (watts)     ","Modèle","Puissance (watts)     ","Modèle","Puissance (watts)     ","Modèle","Puissance (watts)     ","Modèle","Puissance (watts)     ","Modèle","Puissance (watts)     ","Modèle","Puissance (watts)     "]
[{"$f":"A50","v":450},{"$f":"B50","v":9},{"$f":"C50","v":"KOH204000450"},{"$f":"IF(D50=\"\",\" - \",IF($B$6<0.7,D50*POWER($B$8/50,C$46),D50*POWER($B$7/50,C$46)))","v":306},{"$f":"E50","v":"KOH214000450"},{"$f":"IF(F50=\"\",\" - \",IF($B$6<0.7,F50*POWER($B$8/50,E$46),F50*POWER($B$7/50,E$46)))","v":445},{"$f":"G50","v":"KOH224000450"},{"$f":"IF(H50=\"\",\" - \",IF($B$6<0.7,H50*POWER($B$8/50,G$46),H50*POWER($B$7/50,G$46)))","v":573},{"$f":"I50","v":"KOH334000450"},{"$f":"IF(J50=\"\",\" - \",IF($B$6<0.7,J50*POWER($B$8/50,I$46),J50*POWER($B$7/50,I$46)))","v":803},{"$f":"K50","v":"KOH206000450"},{"$f":"IF(L50=\"\",\" - \",IF($B$6<0.7,L50*POWER($B$8/50,K$46),L50*POWER($B$7/50,K$46)))","v":428},{"$f":"M50","v":"KOH216000450"},{"$f":"IF(N50=\"\",\" - \",IF($B$6<0.7,N50*POWER($B$8/50,M$46),N50*POWER($B$7/50,M$46)))","v":602},{"$f":"O50","v":"KOH226000450"},{"$f":"IF(P50=\"\",\" - \",IF($B$6<0.7,P50*POWER($B$8/50,O$46),P50*POWER($B$7/50,O$46)))","v":764},{"$f":"Q50","v":"KOH336000450"},{"$f":"IF(R50=\"\",\" - \",IF($B$6<0.7,R50*POWER($B$8/50,Q$46),R50*POWER($B$7/50,Q$46)))","v":1114},null,null,null,null,null,null,null,null,null,null,null,null,null,","]
[{"$f":"A51","v":600},12,"KOH204000600",407,{"$f":"E51","v":"KOH214000600"},593,{"$f":"G51","v":"KOH224000600"},764,{"$f":"I51","v":"KOH334000600"},1070,{"$f":"K51","v":"KOH206000600"},571,{"$f":"M51","v":"KOH216000600"},802,{"$f":"O51","v":"KOH226000600"},1018,{"$f":"Q51","v":"KOH336000600"},1485]
[750,15,"KOH204000750",509,"KOH214000750",742,"KOH224000750",955,"KOH334000750",1338,"KOH206000750",713,"KOH216000750",1003,"KOH226000750",1273,"KOH336000750",1856]
[900,18,"KOH204000900",611,"KOH214000900",890,"KOH224000900",1146,"KOH334000900",1606,"KOH206000900",856,"KOH216000900",1203,"KOH226000900",1528,"KOH336000900",2228]
[1050,21,"KOH204001050",713,"KOH214001050",1038,"KOH224001050",1337,"KOH334001050",1873,"KOH206001050",999,"KOH216001050",1404,"KOH226001050",1782,"KOH336001050",2599]
[1200,24,"KOH204001200",815,"KOH214001200",1187,"KOH224001200",1529,"KOH334001200",2141,"KOH206001200",1141,"KOH216001200",1604,"KOH226001200",2037,"KOH336001200",2970]
[1350,27,"KOH204001350",917,"KOH214001350",1335,"KOH224001350",1720,"KOH334001350",2408,"KOH206001350",1284,"KOH216001350",1805,"KOH226001350",2291,"KOH336001350",3341]
[1500,30,"KOH204001500",1019,"KOH214001500",1484,"KOH224001500",1911,"KOH334001500",2676,"KOH206001500",1427,"KOH216001500",2006,"KOH226001500",2546,"KOH336001500",3713]
[1650,33,"KOH204001650",1120,"KOH214001650",1632,"KOH224001650",2102,"KOH334001650",2944,"KOH206001650",1569,"KOH216001650",2206,"KOH226001650",2801,"KOH336001650",4084]
[1800,36,"KOH204001800",1222,"KOH214001800",1780,"KOH224001800",2293,"KOH334001800",3211,"KOH206001800",1712,"KOH216001800",2407,"KOH226001800",3055,"KOH336001800",4455]
[1950,39,"KOH204001950",1324,"KOH214001950",1929,"KOH224001950",2484,"KOH334001950",3479,"KOH206001950",1854,"KOH216001950",2607,"KOH226001950",3310,"KOH336001950",4826]
[]
[]
["Hauteur",null,{"$f":"C63","v":750},null,null,null,null,null,null,null,{"$f":"K63","v":900}]
["Type",null,{"$f":"C64","v":"KOH20"},null,{"$f":"E64","v":"KOH21"},null,{"$f":"G64","v":"KOH22"},null,{"$f":"I64","v":"KOH33"},null,{"$f":"K64","v":"KOH20"},null,{"$f":"M64","v":"KOH21"},null,{"$f":"O64","v":"KOH22"},null,{"$f":"Q64","v":"KOH33"}]
["Longueur (mm)","Nombre éléments","Modèle","Puissance (watts)     ","Modèle","Puissance (watts)     ","Modèle","Puissance (watts)     ","Modèle","Puissance (watts)     ","Modèle","Puissance (watts)     ","Modèle","Puissance (watts)     ","Modèle","Puissance (watts)     ","Modèle","Puissance (watts)     "]
[{"$f":"A66","v":450},{"$f":"B66","v":9},{"$f":"C66","v":"KOH207500450"},{"$f":"IF(D66=\"\",\" - \",IF($B$6<0.7,D66*POWER($B$8/50,C$62),D66*POWER($B$7/50,C$62)))","v":512},{"$f":"E66","v":"KOH217500450"},{"$f":"IF(F66=\"\",\" - \",IF($B$6<0.7,F66*POWER($B$8/50,E$62),F66*POWER($B$7/50,E$62)))","v":701},{"$f":"G66","v":"KOH227500450"},{"$f":"IF(H66=\"\",\" - \",IF($B$6<0.7,H66*POWER($B$8/50,G$62),H66*POWER($B$7/50,G$62)))","v":921},{"$f":"I66","v":"KOH337500450"},{"$f":"IF(J66=\"\",\" - \",IF($B$6<0.7,J66*POWER($B$8/50,I$62),J66*POWER($B$7/50,I$62)))","v":1309},{"$f":"K66","v":"KOH209000450"},{"$f":"IF(L66=\"\",\" - \",IF($B$6<0.7,L66*POWER($B$8/50,K$62),L66*POWER($B$7/50,K$62)))","v":590},{"$f":"M66","v":"KOH219000450"},{"$f":"IF(N66=\"\",\" - \",IF($B$6<0.7,N66*POWER($B$8/50,M$62),N66*POWER($B$7/50,M$62)))","v":802},{"$f":"O66","v":"KOH229000450"},{"$f":"IF(P66=\"\",\" - \",IF($B$6<0.7,P66*POWER($B$8/50,O$62),P66*POWER($B$7/50,O$62)))","v":1014},{"$f":"Q66","v":"KOH339000450"},{"$f":"IF(R66=\"\",\" - \",IF($B$6<0.7,R66*POWER($B$8/50,Q$62),R66*POWER($B$7/50,Q$62)))","v":1471}]
[{"$f":"A67","v":600},12,"KOH207500600",683,"KOH217500600",934,"KOH227500600",1229,"KOH337500600",1745,"KOH209000600",786,"KOH219000600",1070,"KOH229000600",1352,"KOH339000600",1961]
[750,15,"KOH207500750",854,"KOH217500750",1168,"KOH227500750",1536,"KOH337500750",2181,"KOH209000750",983,"KOH219000750",1337,"KOH229000750",1690,"KOH339000750",2451]
[900,18,"KOH207500900",1024,"KOH217500900",1401,"KOH227500900",1843,"KOH337500900",2617,"KOH209000900",1179,"KOH219000900",1605,"KOH229000900",2028,"KOH339000900",2941]
[1050,21,"KOH207501050",1195,"KOH217501050",1635,"KOH227501050",2150,"KOH337501050",3053,"KOH209001050",1376,"KOH219001050",1872,"KOH229001050",2366,"KOH339001050",3431]
[1200,24,"KOH207501200",1366,"KOH217501200",1868,"KOH227501200",2457,"KOH337501200",3490,"KOH209001200",1572,"KOH219001200",2140,"KOH229001200",2704,"KOH339001200",3922]
[1350,27,"KOH207501350",1536,"KOH217501350",2102,"KOH227501350",2764,"KOH337501350",3926,"KOH209001350",1769,"KOH219001350",2407,"KOH229001350",3042,"KOH339001350",4412]
[1500,30,"KOH207501500",1707,"KOH217501500",2336,"KOH227501500",3071,"KOH337501500",4362,"KOH209001500",1965,"KOH219001500",2675,"KOH229001500",3380,"KOH339001500",4902]
[1650,33," - "," - "," - "," - "," - "," - "," - "," - "," - "," - "," - "," - "," - "," - "," - "," - "]
[1800,36," - "," - "," - "," - "," - "," - "," - "," - "," - "," - "," - "," - "," - "," - "," - "," - "]
[1950,39," - "," - "," - "," - "," - "," - "," - "," - "," - "," - "," - "," - "," - "," - "," - "," - "]
[]
[]
[]
["Tableau de référence"]
[]
["PENTE :",null,1.2869999999999999,null,1.3261000000000001,null,1.3318000000000001,null,1.3222,null,1.2801,null,1.3310999999999999,null,1.3634999999999999,null,1.3539000000000001]
["Hauteur",null,400,null,null,null,null,null,null,null,600]
["Type",null,"KOH20",null,"KOH21",null,"KOH22",null,"KOH33",null,"KOH20",null,"KOH21",null,"KOH22",null,"KOH33"]
["Longueur (mm)","Nombre éléments","Modèle","Watt \nDt 50°C","Modèle","Watt \nDt 50°C","Modèle","Watt \nDt 50°C","Modèle","Watt \nDt 50°C","Modèle","Watt \nDt 50°C","Modèle","Watt \nDt 50°C","Modèle","Watt \nDt 50°C","Modèle","Watt \nDt 50°C"]
[450,{"$f":"A50/50","v":9},{"$f":"IF(D50=\"\",\" - \",IF(LEN($A50)=3,C$48&$C$47&\"0\"&$A50,C$48&$C$47&$A50))","v":"KOH204000450"},306,{"$f":"IF(F50=\"\",\" - \",IF(LEN($A50)=3,E$48&$C$47&\"0\"&$A50,E$48&$C$47&$A50))","v":"KOH214000450"},445,{"$f":"IF(H50=\"\",\" - \",IF(LEN($A50)=3,G$48&$C$47&\"0\"&$A50,G$48&$C$47&$A50))","v":"KOH224000450"},573,{"$f":"IF(J50=\"\",\" - \",IF(LEN($A50)=3,I$48&$C$47&\"0\"&$A50,I$48&$C$47&$A50))","v":"KOH334000450"},803,{"$f":"IF(L50=\"\",\" - \",IF(LEN($A50)=3,K$48&$K$47&\"0\"&$A50,K$48&$K$47&$A50))","v":"KOH206000450"},428,{"$f":"IF(N50=\"\",\" - \",IF(LEN($A50)=3,M$48&$K$47&\"0\"&$A50,M$48&$K$47&$A50))","v":"KOH216000450"},602,{"$f":"IF(P50=\"\",\" - \",IF(LEN($A50)=3,O$48&$K$47&\"0\"&$A50,O$48&$K$47&$A50))","v":"KOH226000450"},764,{"$f":"IF(R50=\"\",\" - \",IF(LEN($A50)=3,Q$48&$K$47&\"0\"&$A50,Q$48&$K$47&$A50))","v":"KOH336000450"},1114]
[600,{"$f":"A51/50","v":12},"KOH204000600",407,"KOH214000600",593,"KOH224000600",764,"KOH334000600",1070,"KOH206000600",571,"KOH216000600",802,"KOH226000600",1018,"KOH336000600",1485]
[750,15,"KOH204000750",509,"KOH214000750",742,"KOH224000750",955,"KOH334000750",1338,"KOH206000750",713,"KOH216000750",1003,"KOH226000750",1273,"KOH336000750",1856]
[900,18,"KOH204000900",611,"KOH214000900",890,"KOH224000900",1146,"KOH334000900",1606,"KOH206000900",856,"KOH216000900",1203,"KOH226000900",1528,"KOH336000900",2228]
[1050,21,"KOH204001050",713,"KOH214001050",1038,"KOH224001050",1337,"KOH334001050",1873,"KOH206001050",999,"KOH216001050",1404,"KOH226001050",1782,"KOH336001050",2599]
[1200,24,"KOH204001200",815,"KOH214001200",1187,"KOH224001200",1529,"KOH334001200",2141,"KOH206001200",1141,"KOH216001200",1604,"KOH226001200",2037,"KOH336001200",2970]
[1350,27,"KOH204001350",917,"KOH214001350",1335,"KOH224001350",1720,"KOH334001350",2408,"KOH206001350",1284,"KOH216001350",1805,"KOH226001350",2291,"KOH336001350",3341]
[1500,30,"KOH204001500",1019,"KOH214001500",1484,"KOH224001500",1911,"KOH334001500",2676,"KOH206001500",1427,"KOH216001500",2006,"KOH226001500",2546,"KOH336001500",3713]
[1650,33,"KOH204001650",1120,"KOH214001650",1632,"KOH224001650",2102,"KOH334001650",2944,"KOH206001650",1569,"KOH216001650",2206,"KOH226001650",2801,"KOH336001650",4084]
[1800,36,"KOH204001800",1222,"KOH214001800",1780,"KOH224001800",2293,"KOH334001800",3211,"KOH206001800",1712,"KOH216001800",2407,"KOH226001800",3055,"KOH336001800",4455]
[1950,39,"KOH204001950",1324,"KOH214001950",1929,"KOH224001950",2484,"KOH334001950",3479,"KOH206001950",1854,"KOH216001950",2607,"KOH226001950",3310,"KOH336001950",4826]
[]
["PENTE :",null,1.2811999999999999,null,1.3432999999999999,null,1.3607,null,1.3649,null,1.2823,null,1.3440000000000001,null,1.3896999999999999,null,1.3757999999999999,null,null,null,null,null,null,null,null,null,null,null,null,null,null,null,null,null,null,1.3540000000000001]
["Hauteur",null,750,null,null,null,null,null,null,null,900]
["Type",null,"KOH20",null,"KOH21",null,"KOH22",null,"KOH33",null,"KOH20",null,"KOH21",null,"KOH22",null,"KOH33"]
["Longueur (mm)","Nombre éléments","Modèle","Watt \nDt 50°C","Modèle","Watt \nDt 50°C","Modèle","Watt \nDt 50°C","Modèle","Watt \nDt 50°C","Modèle","Watt \nDt 50°C","Modèle","Watt \nDt 50°C","Modèle","Watt \nDt 50°C","Modèle","Watt \nDt 50°C"]
[450,{"$f":"A66/50","v":9},{"$f":"IF(D66=\"\",\" - \",IF(LEN($A50)=3,C$64&$C$63&\"0\"&$A50,C$64&$C$63&$A50))","v":"KOH207500450"},512,{"$f":"IF(F66=\"\",\" - \",IF(LEN($A50)=3,E$64&$C$63&\"0\"&$A50,E$64&$C$63&$A50))","v":"KOH217500450"},701,{"$f":"IF(H66=\"\",\" - \",IF(LEN($A50)=3,G$64&$C$63&\"0\"&$A50,G$64&$C$63&$A50))","v":"KOH227500450"},921,{"$f":"IF(J66=\"\",\" - \",IF(LEN($A50)=3,I$64&$C$63&\"0\"&$A50,I$64&$C$63&$A50))","v":"KOH337500450"},1309,{"$f":"IF(L66=\"\",\" - \",IF(LEN($A66)=3,K$64&$K$63&\"0\"&$A66,K$64&$K$63&$A66))","v":"KOH209000450"},590,{"$f":"IF(N66=\"\",\" - \",IF(LEN($A66)=3,M$64&$K$63&\"0\"&$A66,M$64&$K$63&$A66))","v":"KOH219000450"},802,{"$f":"IF(P66=\"\",\" - \",IF(LEN($A66)=3,O$64&$K$63&\"0\"&$A66,O$64&$K$63&$A66))","v":"KOH229000450"},1014,{"$f":"IF(R66=\"\",\" - \",IF(LEN($A66)=3,Q$64&$K$63&\"0\"&$A66,Q$64&$K$63&$A66))","v":"KOH339000450"},1471]
[600,{"$f":"A67/50","v":12},"KOH207500600",683,"KOH217500600",934,"KOH227500600",1229,"KOH337500600",1745,"KOH209000600",786,"KOH219000600",1070,"KOH229000600",1352,"KOH339000600",1961]
[750,15,"KOH207500750",854,"KOH217500750",1168,"KOH227500750",1536,"KOH337500750",2181,"KOH209000750",983,"KOH219000750",1337,"KOH229000750",1690,"KOH339000750",2451]
[900,18,"KOH207500900",1024,"KOH217500900",1401,"KOH227500900",1843,"KOH337500900",2617,"KOH209000900",1179,"KOH219000900",1605,"KOH229000900",2028,"KOH339000900",2941]
[1050,21,"KOH207501050",1195,"KOH217501050",1635,"KOH227501050",2150,"KOH337501050",3053,"KOH209001050",1376,"KOH219001050",1872,"KOH229001050",2366,"KOH339001050",3431]
[1200,24,"KOH207501200",1366,"KOH217501200",1868,"KOH227501200",2457,"KOH337501200",3490,"KOH209001200",1572,"KOH219001200",2140,"KOH229001200",2704,"KOH339001200",3922]
[1350,27,"KOH207501350",1536,"KOH217501350",2102,"KOH227501350",2764,"KOH337501350",3926,"KOH209001350",1769,"KOH219001350",2407,"KOH229001350",3042,"KOH339001350",4412]
[1500,30,"KOH207501500",1707,"KOH217501500",2336,"KOH227501500",3071,"KOH337501500",4362,"KOH209001500",1965,"KOH219001500",2675,"KOH229001500",3380,"KOH339001500",4902]
[1650,33," - ",null," - ",null," - ",null," - ",null," - ",null," - ",null," - ",null," - "]
[1800,36," - ",null," - ",null," - ",null," - ",null," - ",null," - ",null," - ",null," - "]
[1950,39," - ",null," - ",null," - ",null," - ",null," - ",null," - ",null," - ",null," - "]

{"sheet":"KOS V","index":16,"n_rows":69,"n_cols":22,"rows_kept":69,"cut":false,"hidden":false,"merged":[[10,0,10,1],[10,2,10,7],[10,8,10,13],[2,2,2,6],[3,2,3,6],[4,2,4,6],[11,12,11,13],[19,0,19,1],[19,2,19,7],[19,8,19,13],[20,0,20,1],[20,2,20,3],[20,4,20,5],[20,6,20,7],[20,8,20,9],[20,10,20,11],[11,0,11,1],[11,2,11,3],[11,4,11,5],[11,6,11,7],[11,8,11,9],[11,10,11,11],[20,12,20,13],[30,0,30,1],[30,2,30,7],[31,0,31,1],[31,2,31,3],[31,4,31,5],[31,6,31,7],[41,12,41,13],[41,14,41,19],[42,0,42,1],[42,2,42,7],[42,8,42,13],[42,14,42,16],[42,17,42,19],[41,0,41,1],[41,2,41,3],[41,4,41,5],[41,6,41,7],[41,8,41,9],[41,10,41,11],[43,12,43,13],[50,0,50,1],[50,2,50,3],[50,4,50,5],[50,6,50,7],[50,8,50,9],[50,10,50,11],[50,12,50,13],[43,0,43,1],[43,2,43,3],[43,4,43,5],[43,6,43,7],[43,8,43,9],[43,10,43,11],[50,14,50,19],[51,0,51,1],[51,2,51,7],[51,8,51,13],[51,14,51,16],[51,17,51,19],[52,12,52,13],[62,0,62,1],[62,2,62,3],[62,4,62,5],[62,6,62,7],[62,8,62,10],[52,0,52,1],[52,2,52,3],[52,4,52,5],[52,6,52,7],[52,8,52,9],[52,10,52,11],[63,0,63,1],[63,2,63,3],[63,4,63,5],[63,6,63,7],[64,0,64,1],[64,2,64,3],[64,4,64,5],[64,6,64,7]]}
["Programme de calcul de la puissance thermique: KOS V"]
[]
["Te",75,"<= Entrez la température à l'entrée en C°"]
["Ts",65,"<= Entrez la température à la sortie en C°"]
["Ti",20,"<= Entrez la température ambiante en C°"]
["Rapport",{"$f":"(B4-B5)/(B3-B5)","v":0.81818181818181823}]
["Delta T",{"$f":"((B3+B4)/2)-B5","v":50}]
["Delta T2",{"$f":"(B3-B4)/LN((B3-B5)/(B4-B5))","v":49.83288654563971},"Si Rapport < 0,7"]
[]
[]
["Hauteur",null,{"$f":"C43","v":1500},null,null,null,null,null,{"$f":"I43","v":1800}]
["Type",null,{"$f":"C44","v":"KOV20"},null,{"$f":"E44","v":"KOV21"},null,{"$f":"G44","v":"KOV22"},null,{"$f":"I44","v":"KOV20"},null,{"$f":"K44","v":"KOV21"},null,{"$f":"M44","v":"KOV22"}]
["Longueur (mm)","Nombre éléments","Modèle","Puissance (watts)     ","Modèle","Puissance (watts)     ","Modèle","Puissance (watts)     ","Modèle","Puissance (watts)     ","Modèle","Puissance (watts)     ","Modèle","Puissance (watts)     "]
[{"$f":"A46","v":300},{"$f":"B46","v":6},{"$f":"C46","v":" - "},{"$f":"IF(D46=\"\",\" - \",IF($B$6<0.7,D46*POWER($B$8/50,O46),D46*POWER($B$7/50,O46)))","v":" - "},{"$f":"E46","v":"KOV211500300"},{"$f":"IF(F46=\"\",\" - \",IF($B$6<0.7,F46*POWER($B$8/50,P46),F46*POWER($B$7/50,P46)))","v":850},{"$f":"G46","v":"KOV221500300"},{"$f":"IF(H46=\"\",\" - \",IF($B$6<0.7,H46*POWER($B$8/50,Q46),H46*POWER($B$7/50,Q46)))","v":992},{"$f":"I46","v":"KOV201800300"},{"$f":"IF(J46=\"\",\" - \",IF($B$6<0.7,J46*POWER($B$8/50,R46),J46*POWER($B$7/50,R46)))","v":846},{"$f":"K46","v":"KOV211800300"},{"$f":"IF(L46=\"\",\" - \",IF($B$6<0.7,L46*POWER($B$8/50,S46),L46*POWER($B$7/50,S46)))","v":886},{"$f":"M46","v":"KOV221800300"},{"$f":"IF(N46=\"\",\" - \",IF($B$6<0.7,N46*POWER($B$8/50,T46),N46*POWER($B$7/50,T46)))","v":1046},null,null,null,null,null,null,null,","]
[{"$f":"A47","v":450},9," - ",{"$f":"IF(D47=\"\",\" - \",IF($B$6<0.7,D47*POWER($B$8/50,O47),D47*POWER($B$7/50,O47)))","v":" - "},{"$f":"E47","v":"KOV211500450"},{"$f":"IF(F47=\"\",\" - \",IF($B$6<0.7,F47*POWER($B$8/50,P47),F47*POWER($B$7/50,P47)))","v":1206},{"$f":"G47","v":"KOV221500450"},{"$f":"IF(H47=\"\",\" - \",IF($B$6<0.7,H47*POWER($B$8/50,Q47),H47*POWER($B$7/50,Q47)))","v":1436},{"$f":"I47","v":"KOV201800450"},{"$f":"IF(J47=\"\",\" - \",IF($B$6<0.7,J47*POWER($B$8/50,R47),J47*POWER($B$7/50,R47)))","v":1152},{"$f":"K47","v":"KOV211800450"},{"$f":"IF(L47=\"\",\" - \",IF($B$6<0.7,L47*POWER($B$8/50,S47),L47*POWER($B$7/50,S47)))","v":1329},{"$f":"M47","v":"KOV221800450"},{"$f":"IF(N47=\"\",\" - \",IF($B$6<0.7,N47*POWER($B$8/50,T47),N47*POWER($B$7/50,T47)))","v":1569}]
[600,12," - "," - ","KOV211500600",1563,"KOV221500600",1880,"KOV201800600",1459,"KOV211800600",1772,"KOV221800600",2092]
[750,15," - "," - "," - "," - "," - "," - "," - "," - ","KOV211800750",2215,"KOV221800750",2615]
[]
[]
["Hauteur",null,{"$f":"C52","v":1950},null,null,null,null,null,{"$f":"I52","v":2100}]
["Type",null,{"$f":"C53","v":"KOV20"},null,{"$f":"E53","v":"KOV21"},null,{"$f":"G53","v":"KOV22"},null,{"$f":"I53","v":"KOV20"},null,{"$f":"K53","v":"KOV21"},null,{"$f":"M53","v":"KOV22"}]
["Longueur (mm)","Nombre éléments","Modèle","Puissance (watts)     ","Modèle","Puissance (watts)     ","Modèle","Puissance (watts)     ","Modèle","Puissance (watts)     ","Modèle","Puissance (watts)     ","Modèle","Puissance (watts)     "]
[{"$f":"A55","v":300},{"$f":"B55","v":6},{"$f":"C55","v":"KOV201950300"},{"$f":"IF(D55=\"\",\" - \",IF($B$6<0.7,D55*POWER($B$8/50,O55),D55*POWER($B$7/50,O55)))","v":927},{"$f":"E55","v":"KOV211950300"},{"$f":"IF(F55=\"\",\" - \",IF($B$6<0.7,F55*POWER($B$8/50,P55),F55*POWER($B$7/50,P55)))","v":936},{"$f":"G55","v":"KOV221950300"},{"$f":"IF(H55=\"\",\" - \",IF($B$6<0.7,H55*POWER($B$8/50,Q55),H55*POWER($B$7/50,Q55)))","v":1103},{"$f":"I55","v":"KOV202100300"},{"$f":"IF(J55=\"\",\" - \",IF($B$6<0.7,J55*POWER($B$8/50,R55),J55*POWER($B$7/50,R55)))","v":975},{"$f":"K55","v":"KOV212100300"},{"$f":"IF(L55=\"\",\" - \",IF($B$6<0.7,L55*POWER($B$8/50,S55),L55*POWER($B$7/50,S55)))","v":978},{"$f":"M55","v":"KOV222100300"},{"$f":"IF(N55=\"\",\" - \",IF($B$6<0.7,N55*POWER($B$8/50,T55),N55*POWER($B$7/50,T55)))","v":1161}]
[{"$f":"A56","v":450},9,"KOV201950450",{"$f":"IF(D56=\"\",\" - \",IF($B$6<0.7,D56*POWER($B$8/50,O56),D56*POWER($B$7/50,O56)))","v":1241},"KOV211950450",{"$f":"IF(F56=\"\",\" - \",IF($B$6<0.7,F56*POWER($B$8/50,P56),F56*POWER($B$7/50,P56)))","v":1405},"KOV221950450",{"$f":"IF(H56=\"\",\" - \",IF($B$6<0.7,H56*POWER($B$8/50,Q56),H56*POWER($B$7/50,Q56)))","v":1654},"KOV202100450",{"$f":"IF(J56=\"\",\" - \",IF($B$6<0.7,J56*POWER($B$8/50,R56),J56*POWER($B$7/50,R56)))","v":1310},"KOV212100450",{"$f":"IF(L56=\"\",\" - \",IF($B$6<0.7,L56*POWER($B$8/50,S56),L56*POWER($B$7/50,S56)))","v":1468},"KOV222100450",{"$f":"IF(N56=\"\",\" - \",IF($B$6<0.7,N56*POWER($B$8/50,T56),N56*POWER($B$7/50,T56)))","v":1742}]
[600,12,"KOV201950600",1554,"KOV211950600",1873,"KOV221950600",2205,"KOV202100600",1644,"KOV212100600",1957,"KOV222100600",2323]
[750,15,"KOV201950750",1868,"KOV211950750",2341,"KOV221950750",2756,"KOV202100750",1979,"KOV212100750",2446,"KOV222100750",2903]
[]
[]
["KOS V INOX"]
[]
["Hauteur",null,{"$f":"C64","v":1800}]
["Type",null,{"$f":"C65","v":"KOV21"},null,{"$f":"E65","v":"KOV21"},null,{"$f":"G65","v":"KOV21"}]
["Longueur (mm)","Nombre éléments","Modèle","Puissance (watts)     ","Modèle","Puissance (watts)     ","Modèle","Puissance (watts)     "]
[{"$f":"A67","v":450},{"$f":"B67","v":9},{"$f":"C67","v":"KOV211800450I"},{"$f":"IF(D67=\"\",\" - \",IF($B$6<0.7,D67*POWER($B$8/50,I67),D67*POWER($B$7/50,I67)))","v":1183},{"$f":"E67","v":" - "},{"$f":"IF(F67=\"\",\" - \",IF($B$6<0.7,F67*POWER($B$8/50,J67),F67*POWER($B$7/50,J67)))","v":" - "},{"$f":"G67","v":" - "},{"$f":"IF(H67=\"\",\" - \",IF($B$6<0.7,H67*POWER($B$8/50,K67),H67*POWER($B$7/50,K67)))","v":" - "}]
[{"$f":"A68","v":600},12," - ",{"$f":"IF(D68=\"\",\" - \",IF($B$6<0.7,D68*POWER($B$8/50,I68),D68*POWER($B$7/50,I68)))","v":" - "},"KOV211950600I",{"$f":"IF(F68=\"\",\" - \",IF($B$6<0.7,F68*POWER($B$8/50,J68),F68*POWER($B$7/50,J68)))","v":1601}," - ",{"$f":"IF(H68=\"\",\" - \",IF($B$6<0.7,H68*POWER($B$8/50,K68),H68*POWER($B$7/50,K68)))","v":" - "}]
[750,15," - "," - "," - "," - ","KOV212100750I",2095]
[]
[]
[]
["Tableau de référence"]
[]
[null,null,null,null,null,null,null,null,null,null,null,null,null,null,"PENTE"]
["Hauteur",null,1500,null,null,null,null,null,1800,null,null,null,null,null,1500,null,null,1800]
["Type",null,"KOV20",null,"KOV21",null,"KOV22",null,"KOV20",null,"KOV21",null,"KOV22",null,"KOV20","KOV21","KOV22","KOV20","KOV21","KOV22"]
["Longueur (mm)","Nombre éléments","Modèle","Watt \nDt 50°C","Modèle","Watt \nDt 50°C","Modèle","Watt \nDt 50°C","Modèle","Watt \nDt 50°C","Modèle","Watt \nDt 50°C","Modèle","Watt \nDt 50°C"]
[300,{"$f":"A46/50","v":6},{"$f":"IF(D46=\"\",\" - \",C$44&$C$43&$A46)","v":" - "},null,{"$f":"IF(F46=\"\",\" - \",E$44&$C$43&$A46)","v":"KOV211500300"},850,{"$f":"IF(H46=\"\",\" - \",G$44&$C$43&$A46)","v":"KOV221500300"},992,{"$f":"IF(J46=\"\",\" - \",I$44&$I$43&$A46)","v":"KOV201800300"},846,{"$f":"IF(L46=\"\",\" - \",K$44&$I$43&$A46)","v":"KOV211800300"},886,{"$f":"IF(N46=\"\",\" - \",M$44&$I$43&$A46)","v":"KOV221800300"},1046,null,1.3218000000000001,1.3038000000000001,1.2745,1.3191999999999999,1.3387]
[450,{"$f":"A47/50","v":9},{"$f":"IF(D47=\"\",\" - \",C$44&$C$43&$A47)","v":" - "},null,{"$f":"IF(F47=\"\",\" - \",E$44&$C$43&$A47)","v":"KOV211500450"},1206,{"$f":"IF(H47=\"\",\" - \",G$44&$C$43&$A47)","v":"KOV221500450"},1436,{"$f":"IF(J47=\"\",\" - \",I$44&$I$43&$A47)","v":"KOV201800450"},1152,{"$f":"IF(L47=\"\",\" - \",K$44&$I$43&$A47)","v":"KOV211800450"},1329,{"$f":"IF(N47=\"\",\" - \",M$44&$I$43&$A47)","v":"KOV221800450"},1569,null,1.3184,1.3140000000000001,1.2735000000000001,1.3191999999999999,1.3387]
[600,12," - ",null,"KOV211500600",1563,"KOV221500600",1880,{"$f":"IF(J48=\"\",\" - \",I$44&$I$43&$A48)","v":"KOV201800600"},1459,{"$f":"IF(L48=\"\",\" - \",K$44&$I$43&$A48)","v":"KOV211800600"},1772,{"$f":"IF(N48=\"\",\" - \",M$44&$I$43&$A48)","v":"KOV221800600"},2092,null,1.3149999999999999,1.3241000000000001,1.2726,1.3191999999999999,1.3387]
[750,15," - ",null," - ",null," - ",null,{"$f":"IF(J49=\"\",\" - \",I$44&$I$43&$A49)","v":" - "},null,{"$f":"IF(L49=\"\",\" - \",K$44&$I$43&$A49)","v":"KOV211800750"},2215,{"$f":"IF(N49=\"\",\" - \",M$44&$I$43&$A49)","v":"KOV221800750"},2615,null,null,null,null,1.3191999999999999,1.3387]
[]
[]
["Hauteur",null,1950,null,null,null,null,null,2100,null,null,null,null,null,1950,null,null,2100]
["Type",null,"KOV20",null,"KOV21",null,"KOV22",null,"KOV20",null,"KOV21",null,"KOV22",null,"KOV20","KOV21","KOV22","KOV20","KOV21","KOV22"]
["Longueur (mm)","Nombre éléments","Modèle","Watt \nDt 50°C","Modèle","Watt \nDt 50°C","Modèle","Watt \nDt 50°C","Modèle","Watt \nDt 50°C","Modèle","Watt \nDt 50°C","Modèle","Watt \nDt 50°C"]
[300,{"$f":"A55/50","v":6},{"$f":"IF(D55=\"\",\" - \",C$53&$C$52&$A55)","v":"KOV201950300"},927,{"$f":"IF(F55=\"\",\" - \",E$53&$C$52&$A55)","v":"KOV211950300"},936,{"$f":"IF(H55=\"\",\" - \",G$53&$C$52&$A55)","v":"KOV221950300"},1103,{"$f":"IF(J55=\"\",\" - \",I$53&$I$52&$A55)","v":"KOV202100300"},975,{"$f":"IF(L55=\"\",\" - \",K$53&$I$52&$A55)","v":"KOV212100300"},978,{"$f":"IF(N55=\"\",\" - \",M$53&$I$52&$A55)","v":"KOV222100300"},1161,1.3026,1.3230999999999999,1.4255,1.2952999999999999,1.3327,1.3343]
[450,{"$f":"A56/50","v":9},{"$f":"IF(D56=\"\",\" - \",C$53&$C$52&$A56)","v":"KOV201950450"},1241,{"$f":"IF(F56=\"\",\" - \",E$53&$C$52&$A56)","v":"KOV211950450"},1405,{"$f":"IF(H56=\"\",\" - \",G$53&$C$52&$A56)","v":"KOV221950450"},1654,{"$f":"IF(J56=\"\",\" - \",I$53&$I$52&$A56)","v":"KOV202100450"},1310,{"$f":"IF(L56=\"\",\" - \",K$53&$I$52&$A56)","v":"KOV212100450"},1468,{"$f":"IF(N56=\"\",\" - \",M$53&$I$52&$A56)","v":"KOV222100450"},1742,1.2965,1.3230999999999999,1.4255,1.2887,1.3327,1.3343]
[600,12,"KOV201950600",1554,"KOV211950600",1873,"KOV221950600",2205,{"$f":"IF(J57=\"\",\" - \",I$53&$I$52&$A57)","v":"KOV202100600"},1644,{"$f":"IF(L57=\"\",\" - \",K$53&$I$52&$A57)","v":"KOV212100600"},1957,{"$f":"IF(N57=\"\",\" - \",M$53&$I$52&$A57)","v":"KOV222100600"},2323,1.2903,1.3230999999999999,1.4255,1.2822,1.3327,1.3343]
[750,15,"KOV201950750",1868,"KOV211950750",2341,"KOV221950750",2756,{"$f":"IF(J58=\"\",\" - \",I$53&$I$52&$A58)","v":"KOV202100750"},1979,{"$f":"IF(L58=\"\",\" - \",K$53&$I$52&$A58)","v":"KOV212100750"},2446,{"$f":"IF(N58=\"\",\" - \",M$53&$I$52&$A58)","v":"KOV222100750"},2903,1.2842,1.3230999999999999,1.4255,1.2756000000000001,1.3327,1.3343]
[]
[]
["KOS V INOX"]
[]
[null,null,null,null,null,null,null,null,"PENTE"]
["Hauteur",null,1800,null,1950,null,2100,null,1800,1950,2100]
["Type",null,"KOV21",null,"KOV21",null,"KOV21",null,"KOV21","KOV21","KOV21"]
["Longueur (mm)","Nombre éléments","Modèle","Watt \nDt 50°C","Modèle","Watt \nDt 50°C","Modèle","Watt \nDt 50°C"]
[450,{"$f":"A67/50","v":9},{"$f":"IF(D67=\"\",\" - \",C$65&$C$64&$A67&\"I\")","v":"KOV211800450I"},1183,{"$f":"IF(F67=\"\",\" - \",E$65&$E$64&$A67&\"I\")","v":" - "},null,{"$f":"IF(H67=\"\",\" - \",G$65&$G$64&$A67&\"I\")","v":" - "},null,1.3308]
[600,{"$f":"A68/50","v":12},{"$f":"IF(D68=\"\",\" - \",C$65&$C$64&$A68&\"I\")","v":" - "},null,{"$f":"IF(F68=\"\",\" - \",E$65&$E$64&$A68&\"I\")","v":"KOV211950600I"},1601,{"$f":"IF(H68=\"\",\" - \",G$65&$G$64&$A68&\"I\")","v":" - "},null,null,1.36]
[750,15," - ",null," - ",null,"KOV212100750I",2095,null,null,1.3693]

{"sheet":"TINOS","index":17,"n_rows":30,"n_cols":21,"rows_kept":30,"cut":false,"hidden":false,"merged":[[11,9,11,10],[11,11,11,12],[2,2,2,6],[3,2,3,6],[10,1,10,6],[10,7,10,12],[11,1,11,2],[11,3,11,4],[11,5,11,6],[11,7,11,8],[4,2,4,6],[22,11,22,12],[22,13,22,18],[23,1,23,4],[23,5,23,8],[23,9,23,12],[22,1,22,2],[22,3,22,4],[22,5,22,6],[22,7,22,8],[22,9,22,10],[23,13,23,14],[23,15,23,16],[23,17,23,18],[24,11,24,12],[24,1,24,2],[24,3,24,4],[24,5,24,6],[24,7,24,8],[24,9,24,10]]}
["Programme de calcul de la puissance thermique: TINOS"]
[]
["Te",75,"<= Entrez la température à l'entrée en C°"]
["Ts",65,"<= Entrez la température à la sortie en C°"]
["Ti",20,"<= Entrez la température ambiante en C°"]
["Rapport",{"$f":"(B4-B5)/(B3-B5)","v":0.81818181818181823}]
["Delta T",{"$f":"((B3+B4)/2)-B5","v":50}]
["Delta T2",{"$f":"(B3-B4)/LN((B3-B5)/(B4-B5))","v":49.83288654563971},"Si Rapport < 0,7"]
[]
[]
["Hauteur",{"$f":"B24","v":1800},null,null,null,null,null,{"$f":"F24","v":1950}]
["Type",{"$f":"B25","v":"TIV11"},null,{"$f":"D25","v":"TIV21"},null,{"$f":"F25","v":"TIV11"},null,{"$f":"H25","v":"TIV21"},null,{"$f":"J25","v":"TIV11"},null,{"$f":"L25","v":"TIV21"}]
["Longueur (mm)","Modèle","Puissance (watts)     ","Modèle","Puissance (watts)     ","Modèle","Puissance (watts)     ","Modèle","Puissance (watts)     ","Modèle","Puissance (watts)     ","Modèle","Puissance (watts)     "]
[{"$f":"A27","v":325},{"$f":"B27","v":"TIV111800325"},{"$f":"IF(C27=\"\",\" - \",IF($B$6<0.7,C27*POWER($B$8/50,N27),C27*POWER($B$7/50,N27)))","v":653},{"$f":"D27","v":"TIV211800325"},{"$f":"IF(E27=\"\",\" - \",IF($B$6<0.7,E27*POWER($B$8/50,O27),E27*POWER($B$7/50,O27)))","v":886},{"$f":"F27","v":"TIV111800325"},{"$f":"IF(G27=\"\",\" - \",IF($B$6<0.7,G27*POWER($B$8/50,P27),G27*POWER($B$7/50,P27)))","v":720},{"$f":"H27","v":"TIV211950325"},{"$f":"IF(I27=\"\",\" - \",IF($B$6<0.7,I27*POWER($B$8/50,Q27),I27*POWER($B$7/50,Q27)))","v":936},{"$f":"J27","v":" - "},{"$f":"IF(K27=\"\",\" - \",IF($B$6<0.7,K27*POWER($B$8/50,R27),K27*POWER($B$7/50,R27)))","v":" - "},{"$f":"L27","v":" - "},{"$f":"IF(M27=\"\",\" - \",IF($B$6<0.7,M27*POWER($B$8/50,S27),M27*POWER($B$7/50,S27)))","v":" - "},null,null,null,null,null,null,null,","]
[{"$f":"A28","v":475},{"$f":"B28","v":"TIV111800475"},{"$f":"IF(C28=\"\",\" - \",IF($B$6<0.7,C28*POWER($B$8/50,N28),C28*POWER($B$7/50,N28)))","v":976},{"$f":"D28","v":"TIV211800475"},{"$f":"IF(E28=\"\",\" - \",IF($B$6<0.7,E28*POWER($B$8/50,O28),E28*POWER($B$7/50,O28)))","v":1329},{"$f":"F28","v":"TIV111800475"},{"$f":"IF(G28=\"\",\" - \",IF($B$6<0.7,G28*POWER($B$8/50,P28),G28*POWER($B$7/50,P28)))","v":1056},{"$f":"H28","v":"TIV211950475"},{"$f":"IF(I28=\"\",\" - \",IF($B$6<0.7,I28*POWER($B$8/50,Q28),I28*POWER($B$7/50,Q28)))","v":1405},{"$f":"J28","v":" - "},{"$f":"IF(K28=\"\",\" - \",IF($B$6<0.7,K28*POWER($B$8/50,R28),K28*POWER($B$7/50,R28)))","v":" - "},{"$f":"L28","v":" - "},{"$f":"IF(M28=\"\",\" - \",IF($B$6<0.7,M28*POWER($B$8/50,S28),M28*POWER($B$7/50,S28)))","v":" - "}]
[625,{"$f":"B29","v":"TIV111800625"},1298,"TIV211800625",1772,"TIV111800625",1393,"TIV211950625",1873,"TIV111950625",1429,"TIV211950625",1957]
[775,{"$f":"B30","v":" - "}," - "," - "," - ","TIV111800775",1729,"TIV211950775",2341,"TIV111950775",1749,"TIV211950775",2446]
[]
[]
[]
["Tableau de référence"]
[]
[null,null,null,null,null,null,null,null,null,null,null,null,null,"PENTE"]
["Hauteur",1800,null,null,null,1950,null,null,null,2100,null,null,null,1800,null,1950,null,2100]
["Type","TIV11",null,"TIV21",null,"TIV11",null,"TIV21",null,"TIV11",null,"TIV21",null,"TIV11","TIV21","TIV11","TIV21","TIV11","TIV21"]
["Longueur (mm)","Modèle","Watt \nDt 50°C","Modèle","Watt \nDt 50°C","Modèle","Watt \nDt 50°C","Modèle","Watt \nDt 50°C","Modèle","Watt \nDt 50°C","Modèle","Watt \nDt 50°C"]
[325,{"$f":"IF(C27=\"\",\" - \",B$25&$B$24&$A27)","v":"TIV111800325"},653,{"$f":"IF(E27=\"\",\" - \",D$25&$B$24&$A27)","v":"TIV211800325"},886,{"$f":"IF(G27=\"\",\" - \",F$25&$B$24&$A27)","v":"TIV111800325"},720,{"$f":"IF(I27=\"\",\" - \",H$25&$F$24&$A27)","v":"TIV211950325"},936,{"$f":"IF(K27=\"\",\" - \",J$25&$F$24&$A27)","v":" - "},null,{"$f":"IF(M27=\"\",\" - \",L$25&$F$24&$A27)","v":" - "},null,1.2809999999999999,1.3191999999999999,1.2418,1.3230999999999999]
[475,{"$f":"IF(C28=\"\",\" - \",B$25&$B$24&$A28)","v":"TIV111800475"},976,{"$f":"IF(E28=\"\",\" - \",D$25&$B$24&$A28)","v":"TIV211800475"},1329,{"$f":"IF(G28=\"\",\" - \",F$25&$B$24&$A28)","v":"TIV111800475"},1056,{"$f":"IF(I28=\"\",\" - \",H$25&$F$24&$A28)","v":"TIV211950475"},1405,{"$f":"IF(K28=\"\",\" - \",J$25&$F$24&$A28)","v":" - "},null,{"$f":"IF(M28=\"\",\" - \",L$25&$F$24&$A28)","v":" - "},null,1.2761,1.3191999999999999,1.2810999999999999,1.3230999999999999]
[625,{"$f":"IF(C29=\"\",\" - \",B$25&$B$24&$A29)","v":"TIV111800625"},1298,{"$f":"IF(E29=\"\",\" - \",D$25&$B$24&$A29)","v":"TIV211800625"},1772,{"$f":"IF(G29=\"\",\" - \",F$25&$B$24&$A29)","v":"TIV111800625"},1393,{"$f":"IF(I29=\"\",\" - \",H$25&$F$24&$A29)","v":"TIV211950625"},1873,{"$f":"IF(K29=\"\",\" - \",J$25&$F$24&$A29)","v":"TIV111950625"},1429,{"$f":"IF(M29=\"\",\" - \",L$25&$F$24&$A29)","v":"TIV211950625"},1957,1.2710999999999999,1.3191999999999999,1.3205,1.3230999999999999,1.2575000000000001,1.3327]
[775,{"$f":"IF(C30=\"\",\" - \",B$25&$B$24&$A30)","v":" - "},null,{"$f":"IF(E30=\"\",\" - \",D$25&$B$24&$A30)","v":" - "},null,{"$f":"IF(G30=\"\",\" - \",F$25&$B$24&$A30)","v":"TIV111800775"},1729,{"$f":"IF(I30=\"\",\" - \",H$25&$F$24&$A30)","v":"TIV211950775"},2341,{"$f":"IF(K30=\"\",\" - \",J$25&$F$24&$A30)","v":"TIV111950775"},1749,{"$f":"IF(M30=\"\",\" - \",L$25&$F$24&$A30)","v":"TIV211950775"},2446,null,null,1.3597999999999999,1.3230999999999999,1.2685,1.3327]

{"sheet":"PAROS","index":18,"n_rows":38,"n_cols":19,"rows_kept":38,"cut":false,"hidden":false,"merged":[[28,9,28,10],[28,11,28,12],[26,9,26,10],[26,11,26,12],[28,7,28,8],[27,1,27,4],[27,5,27,8],[28,1,28,2],[28,3,28,4],[28,5,28,6],[26,1,26,2],[26,3,26,4],[26,5,26,6],[26,7,26,8],[26,13,26,18],[27,17,27,18],[27,13,27,14],[11,7,11,8],[10,9,10,12],[11,9,11,10],[11,11,11,12],[10,5,10,8],[27,15,27,16],[27,9,27,12],[2,2,2,6],[3,2,3,6],[4,2,4,6],[11,1,11,2],[11,3,11,4],[11,5,11,6],[10,1,10,4]]}
["Programme de calcul de la puissance thermique: PAROS"]
[]
["Te",75,"<= Entrez la température à l'entrée en C°"]
["Ts",65,"<= Entrez la température à la sortie en C°"]
["Ti",20,"<= Entrez la température ambiante en C°"]
["Rapport",{"$f":"(B4-B5)/(B3-B5)","v":0.81818181818181823}]
["Delta T",{"$f":"((B3+B4)/2)-B5","v":50}]
["Delta T2",{"$f":"(B3-B4)/LN((B3-B5)/(B4-B5))","v":49.83288654563971},"Si Rapport < 0,7"]
[]
[]
["Hauteur",{"$f":"B28","v":1800},null,null,null,{"$f":"F28","v":1950},null,null,null,{"$f":"J28","v":2100}]
["Type",{"$f":"B29","v":"PAV11"},null,{"$f":"D29","v":"PAV21"},null,{"$f":"F29","v":"PAV11"},null,{"$f":"H29","v":"PAV21"},null,{"$f":"J29","v":"PAV11"},null,{"$f":"L29","v":"PAV21"}]
["Longueur (mm)","Modèle","Puissance (watts)     ","Modèle","Puissance (watts)     ","Modèle","Puissance (watts)     ","Modèle","Puissance (watts)     ","Modèle","Puissance (watts)     ","Modèle","Puissance (watts)     "]
[380,{"$f":"B31","v":"PAV111800380"},{"$f":"IF(C31=\"\",\" - \",IF($B$6<0.7,C31*POWER($B$8/50,N31),C31*POWER($B$7/50,N31)))","v":653},{"$f":"D31","v":" - "},{"$f":"IF(E31=\"\",\" - \",IF($B$6<0.7,E31*POWER($B$8/50,O31),E31*POWER($B$7/50,O31)))","v":" - "},{"$f":"F31","v":"PAV111950380"},{"$f":"IF(G31=\"\",\" - \",IF($B$6<0.7,G31*POWER($B$8/50,P31),G31*POWER($B$7/50,P31)))","v":720},{"$f":"H31","v":" - "},{"$f":"IF(I31=\"\",\" - \",IF($B$6<0.7,I31*POWER($B$8/50,Q31),I31*POWER($B$7/50,Q31)))","v":" - "},{"$f":"J31","v":" - "},{"$f":"IF(K31=\"\",\" - \",IF($B$6<0.7,K31*POWER($B$8/50,R31),K31*POWER($B$7/50,R31)))","v":" - "},{"$f":"L31","v":" - "},{"$f":"IF(M31=\"\",\" - \",IF($B$6<0.7,M31*POWER($B$8/50,S31),M31*POWER($B$7/50,S31)))","v":" - "},null,","]
[405,{"$f":"B32","v":" - "}," - ",{"$f":"D32","v":"PAV211800405"},886,{"$f":"F32","v":" - "}," - ",{"$f":"H32","v":"PAV211950405"},936,{"$f":"J32","v":" - "}," - ",{"$f":"L32","v":" - "}," - "]
[530,{"$f":"B33","v":"PAV111800530"},976," - "," - ","PAV111950530",1056," - "," - "," - "," - "," - "," - "]
[555,{"$f":"B34","v":" - "}," - ","PAV211800555",1329," - "," - ","PAV211950555",1405," - "," - "," - "," - "]
[680,{"$f":"B35","v":"PAV111800680"},1298," - "," - ","PAV111950680",1393," - "," - ","PAV112100680",1429," - "," - "]
[705," - "," - ","PAV211800705",1772," - "," - ","PAV211950705",1873," - "," - ","PAV212100705",1957]
[830," - "," - "," - "," - ","PAV111950830",1729," - "," - ","PAV112100830",1749," - "," - "]
[855," - "," - "," - "," - "," - "," - ","PAV211950855",2341," - ",{"$f":"IF(K38=\"\",\" - \",IF($B$6<0.7,K38*POWER($B$8/50,R38),K38*POWER($B$7/50,R38)))","v":" - "},"PAV212100855",2446]
[]
[]
[]
["Tableau de référence"]
[]
[null,null,null,null,null,null,null,null,null,null,null,null,null,"PENTE :"]
["Hauteur",1800,null,null,null,1950,null,null,null,2100,null,null,null,1800,null,1950,null,2100]
["Type","PAV11",null,"PAV21",null,"PAV11",null,"PAV21",null,"PAV11",null,"PAV21",null,"PAV11","PAV21","PAV11","PAV21","PAV11","PAV21"]
["Longueur (mm)","Modèle","Watt \nDt 50°C","Modèle","Watt \nDt 50°C","Modèle","Watt \nDt 50°C","Modèle","Watt \nDt 50°C","Modèle","Watt \nDt 50°C","Modèle","Watt \nDt 50°C"]
[380,{"$f":"IF(C31=\"\",\" - \",B$29&$B$28&$A31)","v":"PAV111800380"},653,{"$f":"IF(E31=\"\",\" - \",D$29&$B$28&$A31)","v":" - "},null,{"$f":"IF(G31=\"\",\" - \",F$29&$F$28&$A31)","v":"PAV111950380"},720,{"$f":"IF(I31=\"\",\" - \",H$29&$F$28&$A31)","v":" - "},null,{"$f":"IF(K31=\"\",\" - \",J$29&$J$28&$A31)","v":" - "},null,{"$f":"IF(M31=\"\",\" - \",L$29&$J$28&$A31)","v":" - "},null,1.2809999999999999,null,1.2418]
[405,{"$f":"IF(C32=\"\",\" - \",B$29&$B$28&$A32)","v":" - "},null,"PAV211800405",886," - ",null,"PAV211950405",936," - ",null," - ",null,null,1.3191999999999999,null,1.3230999999999999]
[530,"PAV111800530",976," - ",null,"PAV111950530",1056," - ",null," - ",null," - ",null,1.2761,null,1.2810999999999999]
[555," - ",null,"PAV211800555",1329," - ",null,"PAV211950555",1405," - ",null," - ",null,null,1.3191999999999999,null,1.3230999999999999]
[680,"PAV111800680",1298," - ",null,"PAV111950680",1393," - ",null,"PAV112100680",1429," - ",null,1.2710999999999999,null,1.3205,null,1.2575000000000001]
[705," - ",null,"PAV211800705",1772," - ",null,"PAV211950705",1873," - ",null,"PAV212100705",1957,null,1.3191999999999999,null,1.3230999999999999,null,1.3327]
[830," - ",null," - ",null,"PAV111950830",1729," - ",null,"PAV112100830",1749," - ",null,null,null,1.3597999999999999,null,1.2685]
[855," - ",null," - ",null," - ",null,"PAV211950855",2341," - ",null,"PAV212100855",2446,null,null,null,1.3230999999999999,null,1.3327]

{"sheet":"VERTICAL","index":19,"n_rows":48,"n_cols":44,"rows_kept":48,"cut":false,"hidden":false,"merged":[[42,12,42,13],[42,14,42,15],[42,16,42,17],[42,0,42,1],[42,2,42,3],[42,4,42,5],[42,6,42,7],[42,8,42,9],[42,10,42,11],[40,16,40,17],[41,0,41,1],[41,2,41,9],[41,10,41,17],[33,22,33,23],[33,2,33,3],[33,4,33,5],[33,6,33,7],[33,8,33,9],[33,24,33,25],[40,0,40,1],[40,2,40,3],[40,4,40,5],[40,6,40,7],[40,8,40,9],[40,10,40,11],[40,12,40,13],[40,14,40,15],[33,10,33,11],[33,12,33,13],[33,14,33,15],[33,16,33,17],[33,18,33,19],[33,20,33,21],[33,0,33,1],[31,24,31,25],[32,0,32,1],[32,2,32,9],[32,10,32,17],[32,18,32,25],[31,12,31,13],[31,14,31,15],[31,16,31,17],[31,18,31,19],[31,20,31,21],[31,22,31,23],[31,0,31,1],[31,2,31,3],[31,4,31,5],[31,6,31,7],[31,8,31,9],[19,0,19,1],[19,2,19,9],[19,10,19,17],[31,10,31,11],[20,12,20,13],[20,14,20,15],[20,16,20,17],[20,0,20,1],[20,2,20,3],[20,4,20,5],[20,6,20,7],[20,8,20,9],[20,10,20,11],[10,18,10,25],[11,0,11,1],[11,2,11,3],[11,4,11,5],[11,6,11,7],[11,8,11,9],[11,10,11,11],[11,12,11,13],[11,14,11,15],[11,16,11,17],[10,10,10,17],[11,18,11,19],[11,20,11,21],[11,22,11,23],[11,24,11,25],[2,2,2,7],[3,2,3,7],[4,2,4,7],[10,0,10,1],[10,2,10,9]]}
["Programme de calcul de la puissance thermique: VERTICAL"]
[]
["Te",75,"<= Entrez la température à l'entrée en C°"]
["Ts",65,"<= Entrez la température à la sortie en C°"]
["Ti",20,"<= Entrez la température ambiante en C°"]
["Rapport",{"$f":"(B4-B5)/(B3-B5)","v":0.81818181818181823}]
["Delta T",{"$f":"((B3+B4)/2)-B5","v":50}]
["Delta T2",{"$f":"(B3-B4)/LN((B3-B5)/(B4-B5))","v":49.83288654563971},"Si Rapport < 0,7"]
[]
[]
["Hauteur",null,{"$f":"C33","v":1500},null,null,null,null,null,null,null,{"$f":"K33","v":1800},null,null,null,null,null,null,null,{"$f":"S33","v":1950}]
["Type",null,{"$f":"C34","v":"VR10"},null,{"$f":"E34","v":"VR20"},null,{"$f":"G34","v":"VR21"},null,{"$f":"I34","v":"VR22"},null,{"$f":"K34","v":"VR10"},null,{"$f":"M34","v":"VR20"},null,{"$f":"O34","v":"VR21"},null,{"$f":"Q34","v":"VR22"},null,{"$f":"S34","v":"VR10"},null,{"$f":"U34","v":"VR20"},null,{"$f":"W34","v":"VR21"},null,{"$f":"Y34","v":"VR22"}]
["Longueur (mm)","Nombre éléments","Modèle","Puissance (watts)     ","Modèle","Puissance (watts)     ","Modèle","Puissance (watts)     ","Modèle","Puissance (watts)     ","Modèle","Puissance (watts)     ","Modèle","Puissance (watts)     ","Modèle","Puissance (watts)     ","Modèle","Puissance (watts)     ","Modèle","Puissance (watts)     ","Modèle","Puissance (watts)     ","Modèle","Puissance (watts)     ","Modèle","Puissance (watts)     "]
[{"$f":"A36","v":300},{"$f":"B36","v":6},{"$f":"C36","v":" - "},{"$f":"IF(D36=\"\",\" - \",IF($B$6<0.7,D36*POWER($B$8/50,C$32),D36*POWER($B$7/50,C$32)))","v":" - "},{"$f":"E36","v":" - "},{"$f":"IF(F36=\"\",\" - \",IF($B$6<0.7,F36*POWER($B$8/50,E$32),F36*POWER($B$7/50,E$32)))","v":" - "},{"$f":"G36","v":" - "},{"$f":"IF(H36=\"\",\" - \",IF($B$6<0.7,H36*POWER($B$8/50,G$32),H36*POWER($B$7/50,G$32)))","v":" - "},{"$f":"I36","v":" - "},{"$f":"IF(J36=\"\",\" - \",IF($B$6<0.7,J36*POWER($B$8/50,I$32),J36*POWER($B$7/50,I$32)))","v":" - "},{"$f":"K36","v":" - "},{"$f":"IF(L36=\"\",\" - \",IF($B$6<0.7,L36*POWER($B$8/50,K$32),L36*POWER($B$7/50,K$32)))","v":" - "},{"$f":"M36","v":"VR201800300"},{"$f":"IF(N36=\"\",\" - \",IF($B$6<0.7,N36*POWER($B$8/50,M$32),N36*POWER($B$7/50,M$32)))","v":819},{"$f":"O36","v":"VR211800300"},{"$f":"IF(P36=\"\",\" - \",IF($B$6<0.7,P36*POWER($B$8/50,O$32),P36*POWER($B$7/50,O$32)))","v":963},{"$f":"Q36","v":"VR221800300"},{"$f":"IF(R36=\"\",\" - \",IF($B$6<0.7,R36*POWER($B$8/50,Q$32),R36*POWER($B$7/50,Q$32)))","v":1132},{"$f":"S36","v":" - "},{"$f":"IF(T36=\"\",\" - \",IF($B$6<0.7,T36*POWER($B$8/50,S$32),T36*POWER($B$7/50,S$32)))","v":" - "},{"$f":"U36","v":"VR201950300"},{"$f":"IF(V36=\"\",\" - \",IF($B$6<0.7,V36*POWER($B$8/50,U$32),V36*POWER($B$7/50,U$32)))","v":877},{"$f":"W36","v":"1950300"},{"$f":"IF(X36=\"\",\" - \",IF($B$6<0.7,X36*POWER($B$8/50,W$32),X36*POWER($B$7/50,W$32)))","v":1020},{"$f":"Y36","v":"1950300"},{"$f":"IF(Z36=\"\",\" - \",IF($B$6<0.7,Z36*POWER($B$8/50,Y$32),Z36*POWER($B$7/50,Y$32)))","v":1192},null,null,null,null,null,null,null,null,null,null,null,null,null,","]
[{"$f":"A37","v":450},9,"VR101500450",{"$f":"IF(D37=\"\",\" - \",IF($B$6<0.7,D37*POWER($B$8/50,C$32),D37*POWER($B$7/50,C$32)))","v":650},{"$f":"E37","v":" - "},{"$f":"IF(F37=\"\",\" - \",IF($B$6<0.7,F37*POWER($B$8/50,E$32),F37*POWER($B$7/50,E$32)))","v":" - "},{"$f":"G37","v":" - "},{"$f":"IF(H37=\"\",\" - \",IF($B$6<0.7,H37*POWER($B$8/50,G$32),H37*POWER($B$7/50,G$32)))","v":" - "},{"$f":"I37","v":" - "},{"$f":"IF(J37=\"\",\" - \",IF($B$6<0.7,J37*POWER($B$8/50,I$32),J37*POWER($B$7/50,I$32)))","v":" - "},{"$f":"K37","v":"VR101800450"},{"$f":"IF(L37=\"\",\" - \",IF($B$6<0.7,L37*POWER($B$8/50,K$32),L37*POWER($B$7/50,K$32)))","v":765},{"$f":"M37","v":"VR201800450"},{"$f":"IF(N37=\"\",\" - \",IF($B$6<0.7,N37*POWER($B$8/50,M$32),N37*POWER($B$7/50,M$32)))","v":1229},{"$f":"O37","v":"VR211800450"},{"$f":"IF(P37=\"\",\" - \",IF($B$6<0.7,P37*POWER($B$8/50,O$32),P37*POWER($B$7/50,O$32)))","v":1445},{"$f":"Q37","v":"VR221800450"},{"$f":"IF(R37=\"\",\" - \",IF($B$6<0.7,R37*POWER($B$8/50,Q$32),R37*POWER($B$7/50,Q$32)))","v":1698},{"$f":"S37","v":"VR101950450"},{"$f":"IF(T37=\"\",\" - \",IF($B$6<0.7,T37*POWER($B$8/50,S$32),T37*POWER($B$7/50,S$32)))","v":819},{"$f":"U37","v":"VR201950450"},{"$f":"IF(V37=\"\",\" - \",IF($B$6<0.7,V37*POWER($B$8/50,U$32),V37*POWER($B$7/50,U$32)))","v":1315},{"$f":"W37","v":"1950450"},{"$f":"IF(X37=\"\",\" - \",IF($B$6<0.7,X37*POWER($B$8/50,W$32),X37*POWER($B$7/50,W$32)))","v":1530},{"$f":"Y37","v":"1950450"},{"$f":"IF(Z37=\"\",\" - \",IF($B$6<0.7,Z37*POWER($B$8/50,Y$32),Z37*POWER($B$7/50,Y$32)))","v":1788}]
[600,12,"VR101500600",{"$f":"IF(D38=\"\",\" - \",IF($B$6<0.7,D38*POWER($B$8/50,C$32),D38*POWER($B$7/50,C$32)))","v":867}," - ",{"$f":"IF(F38=\"\",\" - \",IF($B$6<0.7,F38*POWER($B$8/50,E$32),F38*POWER($B$7/50,E$32)))","v":" - "}," - ",{"$f":"IF(H38=\"\",\" - \",IF($B$6<0.7,H38*POWER($B$8/50,G$32),H38*POWER($B$7/50,G$32)))","v":" - "}," - ",{"$f":"IF(J38=\"\",\" - \",IF($B$6<0.7,J38*POWER($B$8/50,I$32),J38*POWER($B$7/50,I$32)))","v":" - "},"VR101800600",{"$f":"IF(L38=\"\",\" - \",IF($B$6<0.7,L38*POWER($B$8/50,K$32),L38*POWER($B$7/50,K$32)))","v":1020},"VR201800600",{"$f":"IF(N38=\"\",\" - \",IF($B$6<0.7,N38*POWER($B$8/50,M$32),N38*POWER($B$7/50,M$32)))","v":1638},"VR211800600",{"$f":"IF(P38=\"\",\" - \",IF($B$6<0.7,P38*POWER($B$8/50,O$32),P38*POWER($B$7/50,O$32)))","v":1926},"VR221800600",{"$f":"IF(R38=\"\",\" - \",IF($B$6<0.7,R38*POWER($B$8/50,Q$32),R38*POWER($B$7/50,Q$32)))","v":2264},"VR101950600",{"$f":"IF(T38=\"\",\" - \",IF($B$6<0.7,T38*POWER($B$8/50,S$32),T38*POWER($B$7/50,S$32)))","v":1092},"VR201950600",{"$f":"IF(V38=\"\",\" - \",IF($B$6<0.7,V38*POWER($B$8/50,U$32),V38*POWER($B$7/50,U$32)))","v":1753},"1950600",{"$f":"IF(X38=\"\",\" - \",IF($B$6<0.7,X38*POWER($B$8/50,W$32),X38*POWER($B$7/50,W$32)))","v":2040},"1950600",{"$f":"IF(Z38=\"\",\" - \",IF($B$6<0.7,Z38*POWER($B$8/50,Y$32),Z38*POWER($B$7/50,Y$32)))","v":2384}]
[750,15," - ",{"$f":"IF(D39=\"\",\" - \",IF($B$6<0.7,D39*POWER($B$8/50,C$32),D39*POWER($B$7/50,C$32)))","v":" - "}," - ",{"$f":"IF(F39=\"\",\" - \",IF($B$6<0.7,F39*POWER($B$8/50,E$32),F39*POWER($B$7/50,E$32)))","v":" - "}," - ",{"$f":"IF(H39=\"\",\" - \",IF($B$6<0.7,H39*POWER($B$8/50,G$32),H39*POWER($B$7/50,G$32)))","v":" - "}," - ",{"$f":"IF(J39=\"\",\" - \",IF($B$6<0.7,J39*POWER($B$8/50,I$32),J39*POWER($B$7/50,I$32)))","v":" - "},"VR101800750",{"$f":"IF(L39=\"\",\" - \",IF($B$6<0.7,L39*POWER($B$8/50,K$32),L39*POWER($B$7/50,K$32)))","v":1275},"VR201800750",{"$f":"IF(N39=\"\",\" - \",IF($B$6<0.7,N39*POWER($B$8/50,M$32),N39*POWER($B$7/50,M$32)))","v":2048},"VR211800750",{"$f":"IF(P39=\"\",\" - \",IF($B$6<0.7,P39*POWER($B$8/50,O$32),P39*POWER($B$7/50,O$32)))","v":2408},"VR221800750",{"$f":"IF(R39=\"\",\" - \",IF($B$6<0.7,R39*POWER($B$8/50,Q$32),R39*POWER($B$7/50,Q$32)))","v":2831},"VR101950750",{"$f":"IF(T39=\"\",\" - \",IF($B$6<0.7,T39*POWER($B$8/50,S$32),T39*POWER($B$7/50,S$32)))","v":1365},"VR201950750",{"$f":"IF(V39=\"\",\" - \",IF($B$6<0.7,V39*POWER($B$8/50,U$32),V39*POWER($B$7/50,U$32)))","v":2192},"1950750",{"$f":"IF(X39=\"\",\" - \",IF($B$6<0.7,X39*POWER($B$8/50,W$32),X39*POWER($B$7/50,W$32)))","v":2550},"1950750",{"$f":"IF(Z39=\"\",\" - \",IF($B$6<0.7,Z39*POWER($B$8/50,Y$32),Z39*POWER($B$7/50,Y$32)))","v":2980}]
[]
[]
["Hauteur",null,{"$f":"C42","v":2100},null,null,null,null,null,null,null,{"$f":"K42","v":2300}]
["Type",null,{"$f":"C43","v":"VR10"},null,{"$f":"E43","v":"VR20"},null,{"$f":"G43","v":"VR21"},null,{"$f":"I43","v":"VR22"},null,{"$f":"K43","v":"VR10"},null,{"$f":"M43","v":"VR20"},null,{"$f":"O43","v":"VR21"},null,{"$f":"Q43","v":"VR22"}]
["Longueur (mm)","Nombre éléments","Modèle","Puissance (watts)     ","Modèle","Puissance (watts)     ","Modèle","Puissance (watts)     ","Modèle","Puissance (watts)     ","Modèle","Puissance (watts)     ","Modèle","Puissance (watts)     ","Modèle","Puissance (watts)     ","Modèle","Puissance (watts)     "]
[{"$f":"A45","v":300},{"$f":"B45","v":6},{"$f":"C45","v":" - "},{"$f":"IF(D45=\"\",\" - \",IF($B$6<0.7,D45*POWER($B$8/50,C$41),D45*POWER($B$7/50,C$41)))","v":" - "},{"$f":"E45","v":"VR202100300"},{"$f":"IF(F45=\"\",\" - \",IF($B$6<0.7,F45*POWER($B$8/50,E$41),F45*POWER($B$7/50,E$41)))","v":935},{"$f":"G45","v":"VR212100300"},{"$f":"IF(H45=\"\",\" - \",IF($B$6<0.7,H45*POWER($B$8/50,G$41),H45*POWER($B$7/50,G$41)))","v":1081},{"$f":"I45","v":"VR222100300"},{"$f":"IF(J45=\"\",\" - \",IF($B$6<0.7,J45*POWER($B$8/50,I$41),J45*POWER($B$7/50,I$41)))","v":1252},{"$f":"K45","v":" - "},{"$f":"IF(L45=\"\",\" - \",IF($B$6<0.7,L45*POWER($B$8/50,K$41),L45*POWER($B$7/50,K$41)))","v":" - "},{"$f":"M45","v":" - "},{"$f":"IF(N45=\"\",\" - \",IF($B$6<0.7,N45*POWER($B$8/50,M$41),N45*POWER($B$7/50,M$41)))","v":" - "},{"$f":"O45","v":" - "},{"$f":"IF(P45=\"\",\" - \",IF($B$6<0.7,P45*POWER($B$8/50,O$41),P45*POWER($B$7/50,O$41)))","v":" - "},{"$f":"Q45","v":"VR222300300"},{"$f":"IF(R45=\"\",\" - \",IF($B$6<0.7,R45*POWER($B$8/50,Q$41),R45*POWER($B$7/50,Q$41)))","v":1332}]
[{"$f":"A46","v":450},9,"VR102100450",{"$f":"IF(D46=\"\",\" - \",IF($B$6<0.7,D46*POWER($B$8/50,C$41),D46*POWER($B$7/50,C$41)))","v":876},{"$f":"E46","v":"VR202100450"},{"$f":"IF(F46=\"\",\" - \",IF($B$6<0.7,F46*POWER($B$8/50,E$41),F46*POWER($B$7/50,E$41)))","v":1403},{"$f":"G46","v":"VR212100450"},{"$f":"IF(H46=\"\",\" - \",IF($B$6<0.7,H46*POWER($B$8/50,G$41),H46*POWER($B$7/50,G$41)))","v":1621},{"$f":"I46","v":"VR222100450"},{"$f":"IF(J46=\"\",\" - \",IF($B$6<0.7,J46*POWER($B$8/50,I$41),J46*POWER($B$7/50,I$41)))","v":1877},{"$f":"K46","v":" - "},{"$f":"IF(L46=\"\",\" - \",IF($B$6<0.7,L46*POWER($B$8/50,K$41),L46*POWER($B$7/50,K$41)))","v":" - "},{"$f":"M46","v":" - "},{"$f":"IF(N46=\"\",\" - \",IF($B$6<0.7,N46*POWER($B$8/50,M$41),N46*POWER($B$7/50,M$41)))","v":" - "},{"$f":"O46","v":" - "},{"$f":"IF(P46=\"\",\" - \",IF($B$6<0.7,P46*POWER($B$8/50,O$41),P46*POWER($B$7/50,O$41)))","v":" - "},{"$f":"Q46","v":"VR222300450"},{"$f":"IF(R46=\"\",\" - \",IF($B$6<0.7,R46*POWER($B$8/50,Q$41),R46*POWER($B$7/50,Q$41)))","v":1998}]
[600,12,"VR102100600",{"$f":"IF(D47=\"\",\" - \",IF($B$6<0.7,D47*POWER($B$8/50,C$41),D47*POWER($B$7/50,C$41)))","v":1168},{"$f":"E47","v":"VR202100600"},{"$f":"IF(F47=\"\",\" - \",IF($B$6<0.7,F47*POWER($B$8/50,E$41),F47*POWER($B$7/50,E$41)))","v":1870},{"$f":"G47","v":"VR212100600"},{"$f":"IF(H47=\"\",\" - \",IF($B$6<0.7,H47*POWER($B$8/50,G$41),H47*POWER($B$7/50,G$41)))","v":2162},{"$f":"I47","v":"VR222100600"},{"$f":"IF(J47=\"\",\" - \",IF($B$6<0.7,J47*POWER($B$8/50,I$41),J47*POWER($B$7/50,I$41)))","v":2503},{"$f":"K47","v":" - "},{"$f":"IF(L47=\"\",\" - \",IF($B$6<0.7,L47*POWER($B$8/50,K$41),L47*POWER($B$7/50,K$41)))","v":" - "},{"$f":"M47","v":" - "},{"$f":"IF(N47=\"\",\" - \",IF($B$6<0.7,N47*POWER($B$8/50,M$41),N47*POWER($B$7/50,M$41)))","v":" - "},{"$f":"O47","v":" - "},{"$f":"IF(P47=\"\",\" - \",IF($B$6<0.7,P47*POWER($B$8/50,O$41),P47*POWER($B$7/50,O$41)))","v":" - "},{"$f":"Q47","v":"VR222300600"},{"$f":"IF(R47=\"\",\" - \",IF($B$6<0.7,R47*POWER($B$8/50,Q$41),R47*POWER($B$7/50,Q$41)))","v":2663}]
[750,15,"VR102100750",{"$f":"IF(D48=\"\",\" - \",IF($B$6<0.7,D48*POWER($B$8/50,C$41),D48*POWER($B$7/50,C$41)))","v":1460},{"$f":"E48","v":"VR202100750"},{"$f":"IF(F48=\"\",\" - \",IF($B$6<0.7,F48*POWER($B$8/50,E$41),F48*POWER($B$7/50,E$41)))","v":2338},{"$f":"G48","v":"VR212100750"},{"$f":"IF(H48=\"\",\" - \",IF($B$6<0.7,H48*POWER($B$8/50,G$41),H48*POWER($B$7/50,G$41)))","v":2702},{"$f":"I48","v":"VR222100750"},{"$f":"IF(J48=\"\",\" - \",IF($B$6<0.7,J48*POWER($B$8/50,I$41),J48*POWER($B$7/50,I$41)))","v":3129},{"$f":"K48","v":" - "},{"$f":"IF(L48=\"\",\" - \",IF($B$6<0.7,L48*POWER($B$8/50,K$41),L48*POWER($B$7/50,K$41)))","v":" - "},{"$f":"M48","v":" - "},{"$f":"IF(N48=\"\",\" - \",IF($B$6<0.7,N48*POWER($B$8/50,M$41),N48*POWER($B$7/50,M$41)))","v":" - "},{"$f":"O48","v":" - "},{"$f":"IF(P48=\"\",\" - \",IF($B$6<0.7,P48*POWER($B$8/50,O$41),P48*POWER($B$7/50,O$41)))","v":" - "},{"$f":"Q48","v":"VR222300750"},{"$f":"IF(R48=\"\",\" - \",IF($B$6<0.7,R48*POWER($B$8/50,Q$41),R48*POWER($B$7/50,Q$41)))","v":3329}]
[]
[]
[]
["Tableau de référence"]
[]
["PENTE :",null,1.2976000000000001,null,null,null,null,null,null,null,1.3246,null,1.3093999999999999,null,1.3384,null,1.3566,null,1.3381000000000001,null,1.3134999999999999,null,1.3422000000000001,null,1.3619000000000001]
["Hauteur",null,1500,null,null,null,null,null,null,null,1800,null,null,null,null,null,null,null,1950]
["Type",null,"VR10",null,"VR20",null,"VR21",null,"VR22",null,"VR10",null,"VR20",null,"VR21",null,"VR22",null,"VR10",null,"VR20",null,"VR21",null,"VR22"]
["Longueur (mm)","Nombre éléments","Modèle","Watt \nDt 50°C","Modèle","Watt \nDt 50°C","Modèle","Watt \nDt 50°C","Modèle","Watt \nDt 50°C","Modèle","Watt \nDt 50°C","Modèle","Watt \nDt 50°C","Modèle","Watt \nDt 50°C","Modèle","Watt \nDt 50°C","Modèle","Watt \nDt 50°C","Modèle","Watt \nDt 50°C","Modèle","Watt \nDt 50°C","Modèle","Watt \nDt 50°C"]
[300,{"$f":"A36/50","v":6},{"$f":"IF(D36=\"\",\" - \",C$34&$C$33&$A36)","v":" - "},null,{"$f":"IF(F36=\"\",\" - \",E$34&$C$33&$A36)","v":" - "},null,{"$f":"IF(H36=\"\",\" - \",G$34&$C$33&$A36)","v":" - "},null,{"$f":"IF(J36=\"\",\" - \",I$34&$C$33&$A36)","v":" - "},null,{"$f":"IF(L36=\"\",\" - \",K$34&$K$33&$A36)","v":" - "},null,{"$f":"IF(N36=\"\",\" - \",M$34&$K$33&$A36)","v":"VR201800300"},819,{"$f":"IF(P36=\"\",\" - \",O$34&$K$33&$A36)","v":"VR211800300"},963,{"$f":"IF(R36=\"\",\" - \",Q$34&$K$33&$A36)","v":"VR221800300"},1132,{"$f":"IF(T36=\"\",\" - \",S$34&$S$33&$A36)","v":" - "},null,{"$f":"IF(V36=\"\",\" - \",U$34&$S$33&$A36)","v":"VR201950300"},877,{"$f":"IF(X36=\"\",\" - \",SW$34&$S$33&$A36)","v":"1950300"},1020,{"$f":"IF(Z36=\"\",\" - \",SY$34&$S$33&$A36)","v":"1950300"},1192]
[450,{"$f":"A37/50","v":9},{"$f":"IF(D37=\"\",\" - \",C$34&$C$33&$A37)","v":"VR101500450"},650,{"$f":"IF(F37=\"\",\" - \",E$34&$C$33&$A37)","v":" - "},null,{"$f":"IF(H37=\"\",\" - \",G$34&$C$33&$A37)","v":" - "},null,{"$f":"IF(J37=\"\",\" - \",I$34&$C$33&$A37)","v":" - "},null,{"$f":"IF(L37=\"\",\" - \",K$34&$K$33&$A37)","v":"VR101800450"},765,{"$f":"IF(N37=\"\",\" - \",M$34&$K$33&$A37)","v":"VR201800450"},1229,{"$f":"IF(P37=\"\",\" - \",O$34&$K$33&$A37)","v":"VR211800450"},1445,{"$f":"IF(R37=\"\",\" - \",Q$34&$K$33&$A37)","v":"VR221800450"},1698,{"$f":"IF(T37=\"\",\" - \",S$34&$S$33&$A37)","v":"VR101950450"},819,{"$f":"IF(V37=\"\",\" - \",U$34&$S$33&$A37)","v":"VR201950450"},1315,{"$f":"IF(X37=\"\",\" - \",SW$34&$S$33&$A37)","v":"1950450"},1530,{"$f":"IF(Z37=\"\",\" - \",SY$34&$S$33&$A37)","v":"1950450"},1788]
[600,12,"VR101500600",867," - ",null," - ",null," - ",null,"VR101800600",1020,"VR201800600",1638,"VR211800600",1926,"VR221800600",2264,"VR101950600",1092,"VR201950600",1753,"1950600",2040,"1950600",2384]
[750,15," - ",null," - ",null," - ",null," - ",null,"VR101800750",1275,"VR201800750",2048,"VR211800750",2408,"VR221800750",2831,"VR101950750",1365,"VR201950750",2192,"1950750",2550,"1950750",2980]
[]
["PENTE :",null,1.3515999999999999,null,1.3176000000000001,null,1.3371,null,1.3672,null,null,null,null,null,null,null,1.3671,null,null,null,null,null,null,null,null,null,null,null,null,null,null,null,null,null,null,null,null,null,null,null,null,null,null,1.3540000000000001]
["Hauteur",null,2100,null,null,null,null,null,null,null,2300]
["Type",null,"VR10",null,"VR20",null,"VR21",null,"VR22",null,"VR10",null,"VR20",null,"VR21",null,"VR22"]
["Longueur (mm)","Nombre éléments","Modèle","Watt \nDt 50°C","Modèle","Watt \nDt 50°C","Modèle","Watt \nDt 50°C","Modèle","Watt \nDt 50°C","Modèle","Watt \nDt 50°C","Modèle","Watt \nDt 50°C","Modèle","Watt \nDt 50°C","Modèle","Watt \nDt 50°C"]
[300,{"$f":"A45/50","v":6},{"$f":"IF(D45=\"\",\" - \",C$43&$C$42&$A36)","v":" - "},null,{"$f":"IF(F45=\"\",\" - \",E$43&$C$42&$A36)","v":"VR202100300"},935,{"$f":"IF(H45=\"\",\" - \",G$43&$C$42&$A36)","v":"VR212100300"},1081,{"$f":"IF(J45=\"\",\" - \",I$43&$C$42&$A36)","v":"VR222100300"},1252,{"$f":"IF(L45=\"\",\" - \",K$43&$K$42&$A45)","v":" - "},null,{"$f":"IF(N45=\"\",\" - \",M$43&$K$42&$A45)","v":" - "},null,{"$f":"IF(P45=\"\",\" - \",SO$43&$K$42&$A45)","v":" - "},null,{"$f":"IF(R45=\"\",\" - \",Q$43&$K$42&$A45)","v":"VR222300300"},1332]
[450,{"$f":"A46/50","v":9},{"$f":"IF(D46=\"\",\" - \",C$43&$C$42&$A37)","v":"VR102100450"},876,{"$f":"IF(F46=\"\",\" - \",E$43&$C$42&$A37)","v":"VR202100450"},1403,{"$f":"IF(H46=\"\",\" - \",G$43&$C$42&$A37)","v":"VR212100450"},1621,{"$f":"IF(J46=\"\",\" - \",I$43&$C$42&$A37)","v":"VR222100450"},1877,{"$f":"IF(L46=\"\",\" - \",K$43&$K$42&$A46)","v":" - "},null,{"$f":"IF(N46=\"\",\" - \",M$43&$K$42&$A46)","v":" - "},null,{"$f":"IF(P46=\"\",\" - \",SO$43&$K$42&$A46)","v":" - "},null,{"$f":"IF(R46=\"\",\" - \",Q$43&$K$42&$A46)","v":"VR222300450"},1998]
[600,12,"VR102100600",1168,"VR202100600",1870,"VR212100600",2162,"VR222100600",2503," - ",null," - ",null," - ",null,"VR222300600",2663]
[750,15,"VR102100750",1460,"VR202100750",2338,"VR212100750",2702,"VR222100750",3129," - ",null," - ",null," - ",null,"VR222300750",3329]